program: Gaussian 09
title: 000074501
version: EM64L-G09RevD.01
frameworkgroup: C1[X(C9H10OS)]
method: RPBEPBE
basis: SDD
operation: Freq
keyword: #p
keyword: freq=noraman
keyword: PBEPBE/SDD
title: #p freq=noraman PBEPBE/SDD
converged: YES YES NO NO
title: Mulliken charges:
elementType: S O C C C C C C C C C H H H H H H H H H H
charge: 0.225062 -0.232287 0.307496 -0.210055 -0.364064 -0.344347 -0.165574 -0.226593 0.121804 -0.789811 -0.863136 0.241301 0.280024 0.239600 0.246026 0.235838 0.236055 0.260962 0.267795 0.267596 0.266308
chargesum: 0.00000
title: Mulliken charges with hydrogens summed into heavy atoms:
elementType: S O C C C C C C C C C
charge: 0.225062 -0.232287 0.307496 -0.210055 -0.122763 -0.064324 0.074026 0.019432 0.121804 -0.056956 -0.061437
polarizability: 2.05033296e+02 5.37901070e+00 1.15517335e+02 -7.71095928e-03 1.34231474e-02 5.47196098e+01
1716.lowfreq: -7.8621 -1.8648 -0.0030 -0.0023 -0.0011 11.3602 50.8074 68.9441 86.1072
frequency: 50.7180 68.9363 86.0803 138.5754 149.8105 212.1742 217.0687 257.3871 279.3055 350.4740 405.0363 424.9342 465.5302 507.3757 587.8382 598.9934 625.7680 672.0351 727.8027 745.4316 821.7460 849.5663 942.9507 954.5627 968.3774 989.0598 994.3612 1003.5380 1025.9105 1061.2052 1084.1280 1123.9927 1195.2459 1279.0312 1299.6554 1349.4296 1358.9457 1369.4999 1414.2524 1448.0611 1455.5761 1462.1254 1462.5436 1480.0240 1551.8367 1588.4441 1609.0258 2984.9183 3009.4617 3069.6883 3123.8646 3127.6633 3135.2590 3135.6253 3139.8509 3160.5754 3164.2187
redmass: 3.7773 3.3671 7.6874 4.0030 1.0316 1.2667 3.9220 3.0244 5.5893 5.3149 2.8732 3.6230 3.2259 6.6821 2.4265 4.3275 7.1136 7.2754 3.6135 6.0493 1.3775 1.3409 2.1799 1.3499 1.1820 1.4369 1.3557 2.6661 1.8197 4.1242 2.2736 1.3437 1.1510 3.5787 1.2801 1.3121 2.0806 1.5222 4.1853 1.1039 1.0519 1.0772 1.0502 2.2583 6.3678 7.1394 6.6070 1.0373 1.0291 1.0970 1.0991 1.1063 1.0917 1.0977 1.0885 1.0951 1.0962
irintensity: 0.0075 2.4559 3.4866 0.4838 0.5949 0.0478 5.7923 0.1078 3.0965 0.9774 0.0010 4.3547 11.3036 21.0672 14.6455 4.2810 0.7779 1.3968 1.4679 14.0779 38.3548 27.5558 46.3842 1.7714 9.2883 8.7139 1.3973 10.6329 0.9275 27.8013 46.5033 10.2687 45.9621 252.7836 4.2501 1.2541 2.5181 75.5709 25.6895 36.2484 15.9175 26.4873 20.8502 0.9245 108.0957 251.3932 58.8199 4.0038 23.5272 13.9923 19.1037 16.6960 9.8787 3.0999 2.1677 12.8839 4.5751
temp: 298.150 k
press: 1.00000 atm
elementType: 16 8 6 6 6 6 6 6 6 6 6 1 1 1 1 1 1 1 1 1 1
symmnumber: 1
zpe: 429253.0 jmol-1
zpe.correction: 0.163494 hartree
zpe.thermalcorrener: 0.174846 hartree
zpe.thermalcorrenthalpy: 0.175790 hartree
zpe.thermalcorrgfe: 0.125568 hartree
zpe.sumelectzpe: -821.435483 hartree
zpe.sumelectthermal: -821.424131 hartree
zpe.sumelectthermalent: -821.423186 hartree
zpe.sumelectthermalfe: -821.473409 hartree
dipole: 3.2402 3.9612 0.0020
dipole: 5.1176
quadrupole: -76.0968 -66.5773 -75.7107
quadrupole: -3.6934 -0.0055 -0.0020
quadrupole: -3.3018 6.2176 -2.9158 -3.6934 -0.0055 -0.0020
hfenergy: -821.5989767 hartree
pointgroup: C01 [X(C9H10O1S1)]
dipole: 1.3091508 1.5058952 -0.2688136 debye
dipolederiv: -0.8031187 -0.0691358 0.0707526 0.0998839 0.0595749 -0.0224255 0.0543426 -0.0073695 -0.0776944 -1.1438434 -0.108043 0.0823395 -0.4627039 -0.6787931 0.07691 0.1187401 0.0460868 -0.3379774 -1.1556378 0.0821441 0.0898896 0.2529379 -0.2019981 -0.0034288 0.0719715 0.0114126 -0.0306343 1.317312 -0.0545864 -0.1154002 -0.1823551 -0.0401967 0.013184 -0.1027774 0.001981 -0.0572798 0.4186687 -0.055188 -0.0421349 0.145995 0.0666018 -0.0330627 -0.0630506 -0.0156271 -0.1239607 0.3135579 0.0655794 -0.0429844 -0.2714239 0.0734441 0.0055375 -0.0080558 -0.0237199 -0.0981711 -0.5928922 0.1326737 0.0263126 0.4244836 -0.0598148 -0.0447371 -0.0035499 -0.0194 -0.1331354 -0.6142218 -0.1265189 0.0553829 -0.2369274 0.0808432 -0.0012898 0.0666946 -0.0109288 -0.1350669 2.0640875 -0.1391955 -0.1544323 -0.0763352 0.9159134 -0.0758962 -0.1606602 -0.0703494 0.1376788 -0.1594756 0.1645517 0.0016453 0.3379137 -0.4206165 0.0196884 -0.0156722 0.0343759 0.0543712 0.0367261 0.107172 -0.0076861 0.1440473 0.0952556 -0.014594 -0.0117506 -0.0114502 0.0741508 0.0605799 0.0727483 -0.000522 0.0865129 -0.0589328 0.0131141 -0.0020682 0.0143978 0.1394709 0.081996 -0.0865847 0.0152316 -0.0272824 0.0334783 0.014834 0.0090823 0.0199378 0.1511012 0.023005 -0.0899496 0.0201779 -0.0854465 -0.019778 0.0248003 0.0197839 0.0253167 0.1442455 0.048768 0.0927928 -0.0001521 0.0715213 -0.0257078 0.0127913 0.0021028 0.0109264 0.1562567 0.082088 -0.0183129 0.0829071 -0.0036446 0.0603436 0.0572724 0.0471327 0.0784239 -0.0531591 0.0580021 -0.0502134 -0.0918215 -0.02545 0.0300904 -0.0694154 -0.0603595 -0.0871142 0.0013099 -0.1218117 0.0276461 0.017504 -0.0421649 0.0977249 0.0059278 0.0245019 0.0001816 0.1188256 0.10508 0.0275178 0.0521507 -0.0822015 -0.0678613 -0.0811461 0.0367486 -0.0695274 -0.024521 0.0862535 0.0269222 -0.0809664 -0.0734698 -0.0353344 0.0988029 -0.0439396 0.0685158 -0.0376524 -0.1051238 -0.00202 0.021806 0.0061095 0.095763 0.003133 0.0207831 0.0039302 0.131842 unknown
polarizability: 204.1290011|1.7409176|114.6206654|-13.1836162|-6.332945|56.5205739 unknown
InChI: InChI=1S/C9H10OS/c1-7(10)8-3-5-9(11-2)6-4-8/h3-6H,1-2H3
charge 0 multiplicity 1
21 atoms
S  3.43545 -0.739751 -0.318293
O  -3.388046 -1.002292 0.302433
C  -1.179578 -0.08715 0.017262
C  1.645077 -0.407862 -0.195357
C  -0.331542 1.035291 -0.172395
C  -0.583844 -1.378768 0.099127
C  1.066164 0.882398 -0.278127
C  0.805064 -1.541489 -0.004953
C  -2.669043 0.028894 0.133805
C  -3.31154 1.411748 0.046213
C  4.162654 0.973226 -0.558047
H  -0.755826 2.04283 -0.239811
H  -1.242606 -2.241216 0.245465
H  1.689707 1.769435 -0.424057
H  1.246453 -2.542311 0.060307
H  -3.084976 1.896584 -0.921776
H  -2.937574 2.076765 0.84702
H  -4.402123 1.305021 0.148093
H  3.949583 1.613452 0.312015
H  3.786367 1.431065 -1.486007
H  5.24908 0.816431 -0.640719
