program: Orca
programVersion: 5.0.2
elementType: Cl Cl O O O N C C C C C C C C C C C C C C C C C C C C C C H H H H H H H H H H H H H H H H H H H
charge: 0
multiplicity: 1
keywords: wb97x-d3
keywords: def2-TZVPP
keywords: def2/J RIJCOSX
keywords: DEFGRID2
keywords: scfconv7
keywords: smallprint printgap noloewdin
keywords: NOSOSCF
formula: C22H19Cl2NO3
InChI: InChI=1/C22H19Cl2NO3/c1-22(2)17(12-19(23)24)20(22)21(26)28-18(13-25)14-7-6-10-16(11-14)27-15-8-4-3-5-9-15/h3-12,17-18,20H,1-2H3
47 atoms
Cl -0.263995 4.419435 0.674254
Cl -2.236318 6.157267 -0.523002
O  1.359225 0.902179 -0.371949
O  -0.188247 0.149164 1.059106
O  1.381708 -4.609146 0.455801
N  4.553671 1.595828 0.088668
C  -2.201141 0.997974 -1.181465
C  -2.096013 2.095925 -0.181615
C  -0.828999 1.531524 -0.787679
C  -2.666084 -0.363132 -0.726585
C  -2.628521 1.33204 -2.589583
C  -2.486546 3.487228 -0.498621
C  0.096648 0.78357 0.075304
C  -1.758549 4.543667 -0.166632
C  2.372029 0.179015 0.325929
C  2.514561 -1.205835 -0.253048
C  3.591036 0.976209 0.177099
C  1.913597 -2.266754 0.409201
C  3.162854 -1.408931 -1.46662
C  1.942325 -3.53144 -0.163764
C  3.210406 -2.682799 -2.008804
C  2.592384 -3.747176 -1.368992
C  0.13657 -4.508782 1.014828
C  -0.878946 -3.74909 0.445512
C  -0.095353 -5.256877 2.160545
C  -2.13366 -3.746866 1.038256
C  -1.356824 -5.249472 2.737031
C  -2.380535 -4.493948 2.182129
H  -2.273323 1.802645 0.850709
H  -0.347516 2.142559 -1.542512
H  -3.743394 -0.446235 -0.880834
H  -2.474555 -0.552901 0.326296
H  -2.190815 -1.153386 -1.310525
H  -3.717989 1.341221 -2.665042
H  -2.256307 0.58213 -3.289563
H  -2.263119 2.30366 -2.924303
H  -3.427148 3.658527 -1.010126
H  2.152465 0.125764 1.396369
H  1.424583 -2.105541 1.361937
H  3.633843 -0.585209 -1.989101
H  3.721067 -2.849048 -2.947912
H  2.615694 -4.739369 -1.801563
H  -0.707955 -3.170334 -0.453816
H  0.706085 -5.843792 2.591677
H  -2.92613 -3.159383 0.592421
H  -1.535262 -5.835216 3.629597
H  -3.362504 -4.488704 2.636263
elementType: Cl O N C H
totalener: -2050.68366915 hartree
nucrepener: 2809.99222832 hartree
electener: -4860.67589747 hartree
oneelecener: -8395.40259207 hartree
twoeener: 3534.72669460 hartree
cpcmener: -0.02957881 hartree
kineticenergy: 2044.48845148 hartree
xcener: -151.865850592928 hartree
chargesum: 0.0000000
charge: -0.048677 -0.054506 -0.273348 -0.448820 -0.328724 -0.087913 0.159975 -0.025680 -0.161156 -0.310361 -0.279110 -0.224341 0.420289 0.079873 0.403256 -0.009794 -0.221741 -0.159978 -0.203428 0.250292 -0.128635 -0.217312 0.292979 -0.202337 -0.254551 -0.144121 -0.116346 -0.194430 0.114818 0.116193 0.101946 0.095830 0.104986 0.101990 0.100456 0.094186 0.139695 0.133724 0.146583 0.141987 0.159954 0.148294 0.158953 0.145293 0.169784 0.157309 0.156663
qa: -0.0487 -0.0545 -0.2733 -0.4488 -0.3287 -0.0879 0.1600 -0.0257 -0.1612 -0.3104 -0.2791 -0.2243 0.4203 0.0799 0.4033 -0.0098 -0.2217 -0.1600 -0.2034 0.2503 -0.1286 -0.2173 0.2930 -0.2023 -0.2546 -0.1441 -0.1163 -0.1944 0.1148 0.1162 0.1019 0.0958 0.1050 0.1020 0.1005 0.0942 0.1397 0.1337 0.1466 0.1420 0.1600 0.1483 0.1590 0.1453 0.1698 0.1573 0.1567
va: 1.2829 1.2515 2.1230 2.0577 2.0825 3.1110 3.6924 3.8698 3.8698 3.8929 3.9144 3.9105 4.1237 4.1842 3.7385 3.6667 4.0605 3.9158 3.9922 3.7595 3.9120 4.0274 3.7073 3.9002 4.0072 3.8770 3.8892 3.9372 1.0202 1.0232 1.0028 1.0122 0.9932 0.9999 1.0028 0.9995 1.0092 1.0210 1.0172 1.0088 0.9897 1.0043 0.9931 1.0086 0.9831 0.9885 0.9921
dispcorr: -0.026329831 hartree
energy: -2050.709998979922
dipole: -12.47238 10.21517 -2.25720 -35.84904 34.66785 -1.18119 -7.42855 6.38204 -1.04651
magnitude: 2.75415 au
magnitude: 7.00050 debye
