program: Orca
programVersion: 5.0.2
elementType: Cl Cl O O O N C C C C C C C C C C C C C C C C C C C C C C H H H H H H H H H H H H H H H H H H H
charge: 0
multiplicity: 1
keywords: wb97x-d3
keywords: def2-TZVPP
keywords: def2/J RIJCOSX
keywords: DEFGRID2
keywords: scfconv7
keywords: smallprint printgap noloewdin
keywords: NOSOSCF
formula: C22H19Cl2NO3
InChI: InChI=1/C22H19Cl2NO3/c1-22(2)17(12-19(23)24)20(22)21(26)28-18(13-25)14-7-6-10-16(11-14)27-15-8-4-3-5-9-15/h3-12,17-18,20H,1-2H3
47 atoms
Cl -0.559517 4.398619 0.62585
Cl -2.485823 6.038452 -0.768417
O  1.357533 0.939367 -0.430065
O  -0.212129 0.178643 0.972485
O  1.509762 -4.543212 0.597038
N  4.51805 1.73409 0.05981
C  -2.155969 0.870357 -1.387653
C  -2.156391 1.990805 -0.408183
C  -0.833286 1.481248 -0.938747
C  -2.573833 -0.501094 -0.918307
C  -2.529181 1.148103 -2.823087
C  -2.593674 3.356992 -0.770814
C  0.085784 0.793329 -0.019925
C  -1.96614 4.450355 -0.362004
C  2.3713 0.269813 0.318505
C  2.56808 -1.13209 -0.20218
C  3.570725 1.093874 0.163112
C  1.978805 -2.184324 0.485104
C  3.257239 -1.361421 -1.388195
C  2.056984 -3.468407 -0.038343
C  3.35722 -2.653443 -1.878402
C  2.749944 -3.709558 -1.216004
C  0.287703 -4.441495 1.206275
C  0.106001 -5.176649 2.369315
C  -0.754568 -3.694559 0.668504
C  -1.130436 -5.163661 2.998645
C  -1.982037 -3.683388 1.315425
C  -2.177655 -4.414407 2.479673
H  -2.36879 1.70753 0.620124
H  -0.346099 2.10237 -1.681778
H  -2.040794 -1.281817 -1.464585
H  -3.639759 -0.638471 -1.108771
H  -2.411689 -0.656238 0.145266
H  -3.612235 1.099441 -2.952359
H  -2.084977 0.401211 -3.48332
H  -2.196061 2.128249 -3.166076
H  -3.481604 3.477027 -1.381323
H  2.126906 0.251847 1.38458
H  1.459759 -2.000192 1.417487
H  3.719645 -0.544568 -1.928867
H  3.901623 -2.841058 -2.794599
H  2.814722 -4.716702 -1.607852
H  0.926163 -5.757633 2.77341
H  -0.623276 -3.130508 -0.246659
H  -1.269858 -5.739215 3.904852
H  -2.793443 -3.101562 0.896273
H  -3.138507 -4.401836 2.97714
elementType: Cl O N C H
totalener: -2050.68378525 hartree
nucrepener: 2808.44476623 hartree
electener: -4859.12855147 hartree
oneelecener: -8392.30244452 hartree
twoeener: 3533.17389305 hartree
cpcmener: -0.02950997 hartree
kineticenergy: 2044.47660693 hartree
xcener: -151.863872879288 hartree
chargesum: -0.0000000
charge: -0.049499 -0.054032 -0.272576 -0.448486 -0.327132 -0.087747 0.156630 -0.033300 -0.153126 -0.302514 -0.279822 -0.217829 0.418617 0.075596 0.402513 -0.005613 -0.222699 -0.174495 -0.207991 0.270201 -0.124386 -0.227479 0.298340 -0.255124 -0.211449 -0.117167 -0.139269 -0.192838 0.115401 0.114387 0.105573 0.102037 0.090310 0.101861 0.100769 0.094177 0.140416 0.133747 0.145892 0.141523 0.159761 0.147932 0.145402 0.163320 0.157509 0.165675 0.156984
qa: -0.0495 -0.0540 -0.2726 -0.4485 -0.3271 -0.0877 0.1566 -0.0333 -0.1531 -0.3025 -0.2798 -0.2178 0.4186 0.0756 0.4025 -0.0056 -0.2227 -0.1745 -0.2080 0.2702 -0.1244 -0.2275 0.2983 -0.2551 -0.2114 -0.1172 -0.1393 -0.1928 0.1154 0.1144 0.1056 0.1020 0.0903 0.1019 0.1008 0.0942 0.1404 0.1337 0.1459 0.1415 0.1598 0.1479 0.1454 0.1633 0.1575 0.1657 0.1570
va: 1.2818 1.2523 2.1238 2.0579 2.0887 3.1109 3.6957 3.8764 3.8595 3.8947 3.9151 3.9057 4.1291 4.1863 3.7410 3.6643 4.0615 3.9156 3.9956 3.7468 3.9109 4.0288 3.7093 4.0086 3.9099 3.8868 3.8779 3.9375 1.0198 1.0237 0.9941 1.0034 1.0131 0.9999 1.0027 0.9996 1.0083 1.0206 1.0172 1.0092 0.9896 1.0051 1.0086 0.9881 0.9885 0.9864 0.9918
dispcorr: -0.026288082 hartree
energy: -2050.710073327025
dipole: -10.01493 7.86576 -2.14918 -36.29749 35.00791 -1.28958 -7.08869 6.03338 -1.05531
magnitude: 2.71949 au
magnitude: 6.91241 debye
