program: Gaussian 09
title: 000074500
version: EM64L-G09RevD.01
frameworkgroup: C1[X(C9H11NO2)]
method: RPBEPBE
basis: SDD
operation: Freq
keyword: #p
keyword: freq=noraman
keyword: PBEPBE/SDD
title: #p freq=noraman PBEPBE/SDD
converged: YES YES NO NO
title: Mulliken charges:
elementType: O O N C C C C C C C C C H H H H H H H H H H H
charge: -0.439949 -0.286227 -0.113503 0.152698 0.155613 0.196924 -0.339682 -0.613493 -0.597515 -0.390518 -0.251218 -0.200511 0.260735 0.223529 0.280829 0.219725 0.248708 0.239039 0.218253 0.218905 0.231966 0.229477 0.356214
chargesum: 0.00000
title: Mulliken charges with hydrogens summed into heavy atoms:
elementType: O O N C C C C C C C C C
charge: -0.083735 -0.286227 -0.113503 0.152698 0.155613 0.196924 -0.078947 0.110590 0.108485 -0.171612 -0.019252 0.028965
polarizability: 1.45995456e+02 3.52548243e+00 1.12763879e+02 -3.06367138e+00 -4.73352634e+00 6.96503443e+01
1716.lowfreq: -11.1165 -4.1242 -0.0009 -0.0009 -0.0007 8.2300 55.6934 86.0438 101.4103
frequency: 55.6911 86.0252 101.4077 141.2002 155.6687 189.9460 202.7467 271.7733 288.4669 311.2918 348.5114 368.0790 416.3509 433.0845 497.6502 534.7775 559.9288 624.7303 681.9612 690.6466 752.2261 763.1124 807.6037 846.9085 910.6945 940.5441 976.3174 1032.9646 1052.6718 1057.4857 1092.3379 1094.2036 1143.9678 1156.1626 1171.6679 1214.1341 1236.2189 1250.1402 1293.0340 1383.5148 1388.8893 1409.6934 1431.1147 1439.6635 1465.6531 1469.9453 1483.9377 1489.0467 1499.8422 1565.5317 1598.6864 1610.0900 2965.7507 2973.1049 3041.6383 3046.0393 3110.5956 3113.4958 3117.4111 3140.0807 3152.8988 3171.5810 3578.7889
redmass: 5.8119 3.0610 4.0442 1.2103 1.1282 2.8875 4.5577 3.2658 3.8439 3.9468 1.1465 3.5076 2.8420 4.3830 3.5769 6.8112 4.1512 6.0404 4.7314 6.2526 1.7115 2.4591 6.2704 1.5079 4.1684 1.4039 1.3341 2.5335 1.4473 2.2662 1.5658 1.3484 1.3883 1.2399 1.0575 2.8624 2.7381 5.0775 1.4408 3.8018 3.8815 1.1810 2.0382 1.3431 1.0558 1.0518 1.8719 1.0695 1.5629 5.5437 6.6130 6.6188 1.0356 1.0362 1.1014 1.1016 1.0889 1.0970 1.0972 1.0877 1.0935 1.1003 1.0660
irintensity: 3.9415 1.0943 4.5262 0.1293 0.2813 0.4016 0.9572 3.1347 5.5072 1.7512 119.8259 16.7749 4.6811 11.7228 16.8707 2.5451 1.2614 7.2757 2.0231 14.4450 71.5182 26.0945 22.6570 0.5168 1.2666 2.5350 0.2738 37.7599 10.8117 26.0685 115.8752 49.8676 2.5969 58.0356 2.3270 29.5257 17.3959 40.3512 47.3328 51.5223 33.0683 45.0112 47.7379 28.6846 17.2390 9.2201 11.8889 29.0367 14.9240 251.1125 50.3720 35.0047 43.1235 102.8578 51.3544 17.8462 12.9325 17.4333 1.7362 5.1649 13.7909 19.1345 30.4701
temp: 298.150 k
press: 1.00000 atm
elementType: 8 8 7 6 6 6 6 6 6 6 6 6 1 1 1 1 1 1 1 1 1 1 1
symmnumber: 1
zpe: 480894.8 jmol-1
zpe.correction: 0.183163 hartree
zpe.thermalcorrener: 0.195099 hartree
zpe.thermalcorrenthalpy: 0.196043 hartree
zpe.thermalcorrgfe: 0.145391 hartree
zpe.sumelectzpe: -553.862812 hartree
zpe.sumelectthermal: -553.850876 hartree
zpe.sumelectthermalent: -553.849932 hartree
zpe.sumelectthermalfe: -553.900584 hartree
dipole: -1.3237 4.0592 2.3749
dipole: 4.8857
quadrupole: -58.7028 -66.1715 -74.2595
quadrupole: 1.1606 4.3344 -7.2098
quadrupole: 7.6751 0.2064 -7.8815 1.1606 4.3344 -7.2098
hfenergy: -554.0459755 hartree
pointgroup: C01 [X(C9H11N1O2)]
dipole: -0.6057686 -0.6215703 -1.7150651 debye
dipolederiv: -0.334717 0.5251904 0.1605039 0.4257991 -0.9584849 -0.1545423 0.1449799 -0.1522917 -0.4299993 -0.7794922 -0.0731215 -0.1816552 -0.0373635 -0.376275 -0.1666591 0.1403681 -0.1236867 -1.1127781 -0.8847356 0.049042 0.3865984 0.0229481 -0.3122187 -0.0558283 0.2797362 -0.0948098 -0.8179087 -0.2462875 -0.0656297 -0.0425311 0.1961272 -0.1761743 -0.0569721 0.0534952 -0.0665792 -0.1084824 1.4650838 0.043434 -0.2936576 -0.0512464 0.1817521 0.2538871 -0.5540155 0.18627 1.4147318 0.2795272 -0.4752741 -0.1492628 -0.3589579 0.8710414 0.2356122 -0.0237412 0.2419459 0.1389102 0.1252086 0.0293445 0.0401678 -0.1047816 0.0685461 0.0733193 -0.0510981 0.1072955 -0.073971 0.4665197 -0.013602 -0.0670352 0.0578415 0.2563192 -0.0521383 0.1356673 -0.0363 -0.0459245 -0.0018153 0.049647 0.0477119 0.0222237 0.2716084 0.0411206 -0.0871966 0.0319294 0.4512661 -0.1861795 0.2999913 0.1178654 0.0134066 -0.1195942 0.0353175 0.0252962 0.061031 -0.1696048 -0.1737443 -0.1196504 -0.0419034 -0.1251073 -0.0542074 0.047602 -0.0402344 0.0416778 -0.1698353 0.0861014 -0.0437003 0.0176078 0.0706294 0.1166413 0.1020831 0.0571885 0.0909292 -0.0917817 0.078558 -0.067166 -0.0395162 -0.0494356 0.0183044 -0.0487007 -0.0254241 -0.0720813 0.1134042 -0.0586958 0.0429173 0.031047 0.1359072 -0.1084958 -0.0655837 0.0605258 -0.0870611 0.0997601 0.1751937 0.0029881 0.0135922 -0.0280604 0.1258231 -0.0182862 -0.1186795 -0.0016064 -0.0122368 -0.0801096 -0.0485711 0.0482165 -0.1310671 -0.0529927 0.0977945 0.0997538 0.111274 0.0437775 -0.0620618 0.0551141 -0.1000593 0.0686499 0.068903 -0.014992 -0.0775345 -0.0180575 0.0867252 0.1131039 0.0264686 0.0043985 0.0548941 -0.1172043 -0.1343108 0.0099545 -0.0352508 -0.0275663 -0.0355349 -0.1025687 0.1379222 -0.1178415 0.0030617 0.102632 0.083456 0.035665 -0.0574686 0.044748 -0.0331061 -0.0262348 -0.0682539 -0.0768826 -0.1013775 -0.0499181 -0.0975814 0.1295104 0.0070089 0.0877517 0.019348 0.1012564 -0.028669 -0.0709367 0.0219022 -0.0681851 0.1448429 -0.1228755 0.0021963 -0.0312551 -0.0047352 0.0985509 -0.0234926 -0.0394606 -0.0218195 0.1443528 0.1251958 -0.1716955 -0.051869 -0.0928328 0.300647 -0.0255482 -0.0450211 -0.0327073 0.3502764 unknown
polarizability: 145.7011407|-4.8713993|100.0977169|-2.020938|20.5112912|82.6108214 unknown
InChI: InChI=1S/C9H11NO2/c1-10(2)9(12)7-5-3-4-6-8(7)11/h3-6,11H,1-2H3
charge 0 multiplicity 1
23 atoms
O  -0.123797 -1.90552 -0.638964
O  1.552075 0.662345 1.754216
N  2.131127 0.194936 -0.45464
C  -0.272071 0.355761 0.209393
C  1.201354 0.399497 0.555893
C  -0.924014 -0.790764 -0.31742
C  -1.073203 1.462238 0.587473
C  3.559853 0.137405 -0.105712
C  1.806133 0.031076 -1.877454
C  -2.328642 -0.813289 -0.494475
C  -2.472153 1.457795 0.404155
C  -3.10019 0.313323 -0.139931
H  -0.575371 2.323262 1.045369
H  3.993787 -0.830834 -0.421315
H  3.653958 0.247755 0.98514
H  4.117802 0.954464 -0.602847
H  0.764885 0.328414 -2.071419
H  1.934635 -1.019116 -2.199752
H  2.472087 0.676177 -2.482646
H  -2.815861 -1.709581 -0.901083
H  -3.066953 2.329757 0.693742
H  -4.18639 0.291129 -0.279618
H  -0.690252 -2.675831 -0.893303
