program: Orca
programVersion: 5.0.2
elementType: Cl Cl O O O N C C C C C C C C C C C C C C C C C C C C C C H H H H H H H H H H H H H H H H H H H
charge: 0
multiplicity: 1
keywords: wb97x-d3
keywords: def2-TZVPP
keywords: def2/J RIJCOSX
keywords: DEFGRID2
keywords: scfconv7
keywords: smallprint printgap noloewdin
keywords: NOSOSCF
formula: C22H19Cl2NO3
InChI: InChI=1/C22H19Cl2NO3/c1-22(2)17(12-19(23)24)20(22)21(26)28-18(13-25)14-7-6-10-16(11-14)27-15-8-4-3-5-9-15/h3-12,17-18,20H,1-2H3
47 atoms
Cl -3.14159 0.946498 -1.879086
Cl -4.781513 0.521285 0.456009
O  1.720729 1.449743 -0.34005
O  2.306009 1.780202 1.786985
O  1.134673 -3.494802 0.651389
N  3.213742 0.80722 -3.201458
C  -0.543672 3.463712 0.434395
C  -1.024695 2.070977 0.13323
C  0.082792 2.27822 1.142224
C  0.205691 4.200907 -0.64714
C  -1.389665 4.371173 1.293095
C  -2.328036 1.584099 0.608895
C  1.470434 1.827561 0.92201
C  -3.279019 1.085101 -0.170116
C  2.997767 0.889763 -0.598767
C  3.141355 -0.506319 -0.03193
C  3.106777 0.856726 -2.059096
C  2.030385 -1.341375 0.013918
C  4.378449 -0.937188 0.416791
C  2.167791 -2.619711 0.53662
C  4.502577 -2.226604 0.919676
C  3.407283 -3.067966 0.986699
C  -0.110382 -3.124655 0.198104
C  -1.043187 -2.654499 1.108641
C  -0.422093 -3.256131 -1.146867
C  -2.314458 -2.318158 0.663048
C  -1.6939 -2.91095 -1.581294
C  -2.641581 -2.442883 -0.680157
H  -0.715736 1.688561 -0.832495
H  -0.194399 2.186656 2.187011
H  -0.49484 4.793992 -1.237658
H  0.730856 3.542878 -1.336397
H  0.934753 4.88867 -0.214149
H  -1.868887 3.850369 2.121394
H  -2.173354 4.839314 0.694541
H  -0.776718 5.167975 1.718153
H  -2.535747 1.631913 1.671511
H  3.800396 1.533599 -0.223704
H  1.070791 -0.991437 -0.344511
H  5.235599 -0.276701 0.382473
H  5.463171 -2.576321 1.274378
H  3.503006 -4.068287 1.390136
H  -0.779612 -2.55817 2.154617
H  0.320219 -3.62329 -1.845119
H  -3.04871 -1.956227 1.370936
H  -1.943912 -3.010104 -2.629701
H  -3.632844 -2.179815 -1.024488
elementType: Cl O N C H
totalener: -2050.68420831 hartree
nucrepener: 2929.33056979 hartree
electener: -4980.01477810 hartree
oneelecener: -8633.95531469 hartree
twoeener: 3653.94053659 hartree
cpcmener: -0.03184976 hartree
kineticenergy: 2044.47662177 hartree
xcener: -151.867005709602 hartree
chargesum: -0.0000000
charge: -0.056133 -0.059657 -0.279410 -0.427711 -0.324832 -0.085437 0.100367 0.054845 -0.105383 -0.268727 -0.263394 -0.225438 0.393292 0.043555 0.363270 0.006952 -0.228115 -0.194116 -0.232651 0.298356 -0.094393 -0.245780 0.234901 -0.178124 -0.168395 -0.156881 -0.155578 -0.141606 0.091128 0.099574 0.097383 0.094979 0.102386 0.089301 0.101517 0.100138 0.136305 0.147355 0.132700 0.143133 0.157257 0.146002 0.149151 0.150760 0.149949 0.157893 0.149313
qa: -0.0561 -0.0597 -0.2794 -0.4277 -0.3248 -0.0854 0.1004 0.0548 -0.1054 -0.2687 -0.2634 -0.2254 0.3933 0.0436 0.3633 0.0070 -0.2281 -0.1941 -0.2327 0.2984 -0.0944 -0.2458 0.2349 -0.1781 -0.1684 -0.1569 -0.1556 -0.1416 0.0911 0.0996 0.0974 0.0950 0.1024 0.0893 0.1015 0.1001 0.1363 0.1474 0.1327 0.1431 0.1573 0.1460 0.1492 0.1508 0.1499 0.1579 0.1493
va: 1.2663 1.2450 2.1110 2.0830 2.0961 3.1095 3.7463 3.7846 3.8992 3.9146 3.9103 3.8553 4.1641 4.1944 3.7633 3.6824 4.0654 3.9230 4.0064 3.7381 3.8914 4.0045 3.7245 3.9921 3.9507 3.8274 3.9267 3.8036 1.0364 1.0303 1.0011 1.0107 0.9996 1.0047 1.0011 1.0018 1.0134 1.0155 1.0264 1.0029 0.9888 1.0080 1.0020 1.0000 1.0006 0.9912 1.0083
dispcorr: -0.028853864 hartree
energy: -2050.713062178355
dipole: 14.24137 -14.73407 -0.49270 9.58104 -8.69073 0.89032 7.85333 -6.60523 1.24809
magnitude: 1.61033 au
magnitude: 4.09312 debye
