program: Orca
programVersion: 5.0.2
elementType: Cl Cl O O O N C C C C C C C C C C C C C C C C C C C C C C H H H H H H H H H H H H H H H H H H H
charge: 0
multiplicity: 1
keywords: wb97x-d3
keywords: def2-TZVPP
keywords: def2/J RIJCOSX
keywords: DEFGRID2
keywords: scfconv7
keywords: smallprint printgap noloewdin
keywords: NOSOSCF
formula: C22H19Cl2NO3
InChI: InChI=1/C22H19Cl2NO3/c1-22(2)17(12-19(23)24)20(22)21(26)28-18(13-25)14-7-6-10-16(11-14)27-15-8-4-3-5-9-15/h3-12,17-18,20H,1-2H3
47 atoms
Cl -3.74608 4.369917 1.079478
Cl -2.953968 6.755821 -0.335974
O  1.839449 1.414611 -0.271424
O  -0.016419 0.831195 0.828236
O  1.617846 -4.179255 1.483732
N  5.09062 1.030408 0.100267
C  -1.262676 2.065369 -1.828919
C  -1.516916 2.951187 -0.641881
C  -0.111528 2.466642 -0.925411
C  -1.815761 0.662558 -1.782514
C  -1.242624 2.64969 -3.220228
C  -1.796824 4.385177 -0.786805
C  0.521937 1.494159 -0.019017
C  -2.706791 5.066894 -0.102727
C  2.570144 0.44485 0.465337
C  2.296497 -0.963167 -0.009376
C  3.978244 0.788781 0.254078
C  2.031102 -1.950171 0.924676
C  2.311882 -1.260827 -1.367403
C  1.80174 -3.253424 0.50268
C  2.068102 -2.562866 -1.774191
C  1.818888 -3.56808 -0.850021
C  0.808978 -5.266414 1.286372
C  1.27134 -6.489039 1.751017
C  -0.452653 -5.152917 0.715396
C  0.458562 -7.609113 1.649339
C  -1.249477 -6.283891 0.610032
C  -0.801394 -7.513253 1.075129
H  -2.010796 2.457566 0.187561
H  0.573248 3.187627 -1.357894
H  -1.180586 -0.024307 -2.3458
H  -2.806176 0.647157 -2.241279
H  -1.921611 0.272546 -0.772226
H  -2.258242 2.761912 -3.604473
H  -0.702793 1.985322 -3.897448
H  -0.757591 3.623836 -3.268342
H  -1.208726 4.94547 -1.50406
H  2.370878 0.530152 1.539007
H  2.006134 -1.715697 1.982195
H  2.51604 -0.493729 -2.103776
H  2.083248 -2.807297 -2.828198
H  1.648881 -4.581408 -1.190791
H  2.256139 -6.559316 2.195848
H  -0.81929 -4.196676 0.363281
H  0.818424 -8.561204 2.017478
H  -2.233697 -6.197419 0.167891
H  -1.432113 -8.388716 0.994502
elementType: Cl O N C H
totalener: -2050.68683497 hartree
nucrepener: 2669.45400612 hartree
electener: -4720.14084109 hartree
oneelecener: -8114.17098437 hartree
twoeener: 3394.03014328 hartree
cpcmener: -0.03193102 hartree
kineticenergy: 2044.47036010 hartree
xcener: -151.863004965723 hartree
chargesum: 0.0000000
charge: -0.054912 -0.059563 -0.277693 -0.433289 -0.324382 -0.087917 0.088832 0.035084 -0.074641 -0.262496 -0.263176 -0.203953 0.368537 0.039301 0.403700 0.033896 -0.225987 -0.232050 -0.232748 0.269197 -0.135977 -0.177413 0.276459 -0.243558 -0.190543 -0.122472 -0.144366 -0.180148 0.079014 0.099576 0.095948 0.101013 0.095249 0.102138 0.098567 0.090928 0.129927 0.141135 0.134654 0.147477 0.160487 0.157325 0.145973 0.158739 0.156977 0.159222 0.157929
qa: -0.0549 -0.0596 -0.2777 -0.4333 -0.3244 -0.0879 0.0888 0.0351 -0.0746 -0.2625 -0.2632 -0.2040 0.3685 0.0393 0.4037 0.0339 -0.2260 -0.2320 -0.2327 0.2692 -0.1360 -0.1774 0.2765 -0.2436 -0.1905 -0.1225 -0.1444 -0.1801 0.0790 0.0996 0.0959 0.1010 0.0952 0.1021 0.0986 0.0909 0.1299 0.1411 0.1347 0.1475 0.1605 0.1573 0.1460 0.1587 0.1570 0.1592 0.1579
va: 1.2705 1.2452 2.1267 2.0815 2.0796 3.1124 3.7457 3.8751 3.8276 3.9053 3.9042 3.8949 4.2332 4.2127 3.7245 3.6027 4.0794 4.0820 3.9649 3.7712 3.9125 3.9153 3.6925 4.0085 3.9176 3.8854 3.8908 3.9026 1.0483 1.0325 1.0011 1.0010 1.0169 1.0011 1.0016 1.0054 1.0182 1.0170 1.0191 1.0126 0.9904 0.9956 1.0079 0.9963 0.9895 0.9903 0.9904
dispcorr: -0.023357640 hartree
energy: -2050.710192606407
dipole: 6.43566 -7.63813 -1.20246 -36.91662 35.77926 -1.13735 -15.50756 13.88944 -1.61812
magnitude: 2.31469 au
magnitude: 5.88349 debye
