program: Gaussian 09
title: 000074491
version: EM64L-G09RevD.01
frameworkgroup: C1[X(C13H11NOS)]
method: RPBEPBE
basis: SDD
operation: Freq
keyword: #p
keyword: freq=noraman
keyword: PBEPBE/SDD
title: #p freq=noraman PBEPBE/SDD
converged: NO NO NO NO
title: Mulliken charges:
elementType: S O N C C C C C C C C C C C C C H H H H H H H H H H H
charge: 0.205020 -0.264462 -0.511605 0.614244 0.565588 -0.318503 -0.320075 -0.424684 -0.441811 -0.418183 0.335296 -0.276431 -0.354656 -0.214179 -0.259769 -0.536803 0.297630 0.219998 0.263314 0.220695 0.242833 0.237029 0.227161 0.230321 0.218701 0.244636 0.218697
chargesum: 0.00000
title: Mulliken charges with hydrogens summed into heavy atoms:
elementType: S O N C C C C C C C C C C C C C
charge: 0.205020 -0.264462 -0.213975 0.614244 0.565588 -0.318503 -0.320075 -0.204687 -0.178498 -0.197488 0.335296 -0.039402 -0.111824 0.012982 -0.029448 0.145231
polarizability: 3.14935534e+02 3.25744403e+00 1.63072898e+02 -6.66518740e-02 -1.55616593e-02 6.75970028e+01
1716.lowfreq: -28.4698 -3.5511 -2.8226 -0.0022 -0.0019 0.0016 8.5375 72.7478 96.8756
frequency: -28.4553 72.7458 96.8722 148.0649 162.1417 181.9065 235.8607 248.0076 251.8005 277.9328 360.6581 363.4150 421.6428 435.4904 440.1017 443.9393 472.1354 505.9537 542.6789 553.1334 573.9483 634.6680 660.0326 674.6793 708.7709 716.3419 746.5942 765.6749 788.1620 842.0801 845.6434 870.7724 884.8524 900.9698 922.1014 961.8234 1007.9166 1025.6003 1041.9433 1053.4805 1115.5271 1124.9920 1142.6048 1168.7186 1171.4907 1207.7014 1242.2765 1245.3165 1280.0485 1300.3968 1359.0020 1386.9313 1408.7151 1427.0930 1439.8104 1465.5674 1475.0278 1486.7858 1498.6107 1505.7428 1589.6249 1590.6627 1600.0558 1626.1568 2950.3955 3033.7966 3111.4363 3116.8872 3121.2271 3130.7009 3145.4593 3156.1465 3168.3538 3169.0285 3559.7939
redmass: 7.3095 3.3293 3.8187 4.5762 4.9121 4.3837 1.2693 3.3611 3.8363 7.3506 4.3715 5.4868 13.1248 3.0808 3.0576 10.1143 4.9776 1.4468 2.8300 5.5232 3.4285 5.8934 6.8480 7.1810 3.2493 3.0924 1.3616 6.1980 1.4942 1.4426 5.9938 1.5224 5.9328 1.3768 1.3804 1.3123 6.9462 4.4752 2.4759 2.8663 1.2598 1.6128 1.3950 1.2419 1.0781 2.3674 1.6443 2.7254 1.4024 2.1894 3.5187 7.4212 3.5179 2.6383 1.2252 1.0498 1.0964 2.6933 2.6265 2.5503 4.2506 6.5208 6.1558 7.0963 1.0337 1.1034 1.0885 1.0894 1.0984 1.0880 1.0924 1.0919 1.0936 1.1003 1.0759
irintensity: 0.0638 5.0152 1.4200 1.3013 0.4804 0.3029 0.5176 3.3438 1.6293 0.3364 6.3314 5.6448 0.1485 1.0699 20.9603 1.3490 0.3681 55.5481 8.4121 15.7108 3.0896 3.2854 6.3701 4.6682 3.7050 4.6522 104.0347 17.6891 66.3447 2.4914 11.4739 25.6533 0.1445 2.1410 3.4691 0.0998 130.3293 39.0157 2.4629 5.6526 0.1829 22.0113 9.0509 2.7155 1.9718 187.8968 3.3556 34.8847 27.3525 2.7081 90.1733 13.4946 25.4417 26.1862 17.5142 13.3936 151.1947 226.2949 282.9696 284.9537 22.6677 8.1813 9.2098 52.1586 91.9126 53.9245 12.5520 25.0943 21.1476 0.9019 19.2413 0.5230 17.2638 24.3766 17.5313
temp: 298.150 k
press: 1.00000 atm
elementType: 16 8 7 6 6 6 6 6 6 6 6 6 6 6 6 6 1 1 1 1 1 1 1 1 1 1 1
symmnumber: 1
zpe: 540488.5 jmol-1
zpe.correction: 0.205861 hartree
zpe.thermalcorrener: 0.218487 hartree
zpe.thermalcorrenthalpy: 0.219431 hartree
zpe.thermalcorrgfe: 0.167276 hartree
zpe.sumelectzpe: -1028.890163 hartree
zpe.sumelectthermal: -1028.877538 hartree
zpe.sumelectthermalent: -1028.876594 hartree
zpe.sumelectthermalfe: -1028.928749 hartree
dipole: 1.1993 3.5544 0.0028
dipole: 3.7513
quadrupole: -78.6506 -89.6706 -108.1348
quadrupole: 4.8534 -0.0071 -0.0142
quadrupole: 13.5014 2.4814 -15.9828 4.8534 -0.0071 -0.0142
hfenergy: -1029.0960247 hartree
pointgroup: C01 [X(C13H11N1O1S1)]
dipole: -0.4537675 -1.404389 0.0016889 debye
polarizability: 314.8262687|5.2146839|163.1821628|0.0606813|-0.0220098|67.5970032 unknown
InChI: InChI=1S/C13H11NOS/c1-15-9-6-7-11-13(8-9)16-12-5-3-2-4-10(12)14-11/h2-8,14H,1H3
charge 0 multiplicity 1
27 atoms
S  0.607015 1.861069 -0.005437
O  -4.425115 0.839785 0.002375
N  0.805292 -1.331425 -0.003758
C  -0.498752 -0.787686 -0.00237
C  2.027894 -0.635976 -0.001294
C  -0.744004 0.61508 -0.002153
C  2.100524 0.785249 -0.000893
C  -1.613756 -1.657939 -0.001012
C  -2.057546 1.109475 -0.000355
C  3.240972 -1.375509 0.000966
C  -3.1635 0.222315 0.000838
C  3.352358 1.431557 0.0020
C  -2.941332 -1.173355 0.000417
C  4.492288 -0.724665 0.003493
C  4.555138 0.686044 0.004132
C  -5.595034 -0.034554 0.003322
H  0.866917 -2.349564 -0.004411
H  -1.44115 -2.741644 -0.001073
H  -2.253656 2.186391 -0.000032
H  3.193333 -2.472141 0.000729
H  -3.771854 -1.884535 0.001328
H  3.390165 2.527102 0.002417
H  5.411476 -1.32023 0.005103
H  5.518953 1.204519 0.00623
H  -5.623484 -0.675415 -0.900845
H  -6.46387 0.640287 0.00427
H  -5.621774 -0.675738 0.907312
