program: Gaussian 09
title: 000074492
version: EM64L-G09RevD.01
frameworkgroup: C1[X(C11H12O3)]
method: RPBEPBE
basis: SDD
operation: Freq
keyword: #pfreq=noraman
keyword: PBEPBE/SDD
title: #p freq=noraman PBEPBE/SDD
converged: YES YES NO NO
title: Mulliken charges:
elementType: O O O C C C C C C C C C C C H H H H H H H H H H H H
charge: -0.229177 -0.416331 -0.239617 -0.143650 -0.554148 0.129725 -0.710447 0.285258 0.152048 -0.340365 -0.348048 -0.246957 -0.228524 -0.222018 0.280711 0.277806 0.239647 0.249905 0.249368 0.205598 0.251769 0.277746 0.232580 0.234417 0.234521 0.378184
chargesum: 0.00000
title: Mulliken charges with hydrogens summed into heavy atoms:
elementType: O O O C C C C C C C C C C C
charge: -0.229177 -0.038147 -0.239617 0.137060 -0.036696 0.129725 -0.005576 0.285258 0.152048 -0.088596 -0.070302 -0.014377 0.005893 0.012503
polarizability: 1.77831822e+02 7.92705170e+00 1.26893367e+02 2.41743110e+00 8.00317976e+00 7.02325440e+01
1716.lowfreq: -9.1348 -7.1677 -3.7493 -0.0009 -0.0006 -0.0005 27.4872 33.4926 48.6316
frequency: 27.3868 33.4634 48.6098 77.8439 92.9419 155.0354 199.3126 205.6151 216.5367 293.3660 321.6476 356.2639 400.1769 413.4389 436.5089 520.3149 543.5314 571.8734 604.3897 613.1456 646.5374 694.3072 696.9964 758.3202 767.3946 835.3352 859.9925 887.8018 923.3469 951.2182 989.6329 992.8360 997.6046 1011.3377 1027.1564 1034.4576 1066.3085 1077.6117 1086.5020 1151.5984 1173.7283 1189.7026 1211.1861 1225.2702 1246.9374 1288.1181 1305.4869 1319.3549 1356.3561 1387.7296 1388.0476 1435.6224 1437.3735 1476.5628 1480.4875 1482.4298 1568.0301 1597.4993 1612.2263 1647.2531 2980.9219 2988.4794 2995.8193 3035.1911 3092.5857 3115.4978 3129.7588 3139.7822 3150.6707 3160.1287 3170.3097 3515.0185
redmass: 8.8869 4.3247 4.3769 3.7734 4.9127 4.6606 2.0854 2.2799 2.3595 3.6103 4.9937 2.3251 2.8242 3.4244 6.0863 3.8853 3.7387 2.7379 1.4197 6.4026 5.8312 3.1911 1.8410 5.0943 1.6865 2.7903 1.2561 2.1251 2.0339 1.4536 6.0800 1.3828 3.0348 1.3370 2.0077 2.3082 1.9301 1.9228 1.6072 1.9689 1.0665 1.1245 1.7396 1.3003 1.7747 1.5482 1.9780 1.4209 2.0059 8.3885 1.2261 1.6872 1.3343 1.0852 1.8749 1.1132 6.8306 6.7814 6.3648 8.6890 1.0632 1.0707 1.0444 1.0971 1.0986 1.1006 1.0852 1.0881 1.0924 1.0961 1.1013 1.0640
irintensity: 2.4536 0.1491 0.7192 3.0867 2.4213 0.0119 0.9740 6.0048 2.7494 3.0759 2.1074 5.7347 0.0552 0.6373 1.7670 61.7573 44.9266 6.2747 93.8094 0.6599 5.6969 33.5495 68.3750 3.0938 62.7992 6.8173 0.2596 5.0384 9.7722 2.1990 1.5334 0.4398 14.6868 0.3337 1.3654 309.6842 32.0569 24.6296 10.2984 1.5693 2.4235 18.9410 29.1620 8.5764 63.5836 95.2156 112.9909 30.7454 15.8510 2.5691 15.0635 15.9061 24.8412 7.1627 2.8406 19.7653 108.5530 48.3732 9.0242 195.8732 17.1744 24.0334 27.0591 8.5723 19.5891 18.8628 0.1246 5.8876 16.0722 19.6359 20.4805 25.5885
temp: 298.150 k
press: 1.00000 atm
elementType: 8 8 8 6 6 6 6 6 6 6 6 6 6 6 1 1 1 1 1 1 1 1 1 1 1 1
symmnumber: 1
zpe: 537669.2 jmol-1
zpe.correction: 0.204787 hartree
zpe.thermalcorrener: 0.218292 hartree
zpe.thermalcorrenthalpy: 0.219236 hartree
zpe.thermalcorrgfe: 0.162579 hartree
zpe.sumelectzpe: -651.026196 hartree
zpe.sumelectthermal: -651.012692 hartree
zpe.sumelectthermalent: -651.011748 hartree
zpe.sumelectthermalfe: -651.068404 hartree
dipole: 1.3447 1.2956 1.1823
dipole: 2.2101
quadrupole: -62.8277 -87.4832 -84.0181
quadrupole: 1.8956 0.0673 1.0588
quadrupole: 15.2820 -9.3736 -5.9084 1.8956 0.0673 1.0588
hfenergy: -651.2309835 hartree
pointgroup: C01 [X(C11H12O3)]
dipole: 0.5138967 0.6082411 0.3493241 debye
dipolederiv: -0.875737 -0.0987476 0.0055237 -0.3481791 -0.8252486 -0.0511661 -0.0102252 -0.0466545 -0.3099699 -1.2961237 -0.3560459 0.0590323 -0.3056595 -0.3917154 -0.0377944 0.0319718 -0.0492855 -0.3887812 -0.7491415 0.0718962 -0.0850604 -0.1485625 -0.8493307 0.2799005 0.0242182 0.2386312 -0.4211313 -0.020865 0.0636464 -0.0589912 0.2870625 -0.1173267 0.1506801 -0.0537334 0.0902813 0.0317687 -0.333049 0.1146039 0.0168131 0.3707437 -0.184385 0.0314178 -0.020424 0.0665327 0.0773399 1.7923204 0.1798117 -0.0172657 0.222372 0.8458109 0.0714213 0.0068762 0.0501665 0.125664 -0.0836556 0.0420046 -0.0083938 -0.0447558 0.0711922 0.0418187 0.030123 0.0323736 0.0640719 -0.7936327 -0.1859767 -0.0092896 -0.1289708 -0.1145671 -0.0104705 -0.0020796 -0.0080171 -0.0215135 1.6439079 0.1294536 0.1416651 0.1963832 1.0693165 -0.421949 0.0827529 -0.3470419 0.3307954 0.1192301 -0.0639803 0.0034464 0.1301154 0.0077679 0.005342 0.0228227 0.0030494 -0.123017 0.0365312 0.1433762 0.0094492 -0.1253673 0.0326511 0.003232 -0.0137039 0.0065781 -0.1015439 -0.2614713 0.0548979 0.0012128 0.1157178 0.1441158 0.0093612 -0.000759 0.0075787 -0.1556358 0.0123161 -0.197005 -0.001901 -0.1961302 -0.0621383 -0.0012696 -0.0032754 -0.0013404 -0.1550854 0.1327889 0.0414508 0.0072318 0.0143425 0.0395349 0.0059152 0.0047335 0.0057664 -0.1329151 0.143465 0.0126186 -0.0144654 -0.1042206 0.0491077 -0.0744783 -0.0178775 -0.0434548 0.0067168 0.1070025 -0.025709 0.04901 -0.1092703 0.0618611 0.0640572 0.0914962 0.0557084 -0.0013075 0.0287581 -0.0154197 -0.028615 -0.0626276 0.0289197 -0.0771447 -0.0489708 -0.0983697 -0.0110142 -0.0811495 -0.1089918 0.0457998 -0.1045408 0.0679595 0.0101105 0.0325167 -0.0091396 0.0835208 0.0239227 0.1147102 -0.0677164 0.1133858 0.0167877 0.0517552 -0.0925912 0.0259769 0.0515497 0.1019872 -0.0222386 -0.0025623 0.0080668 -0.0628577 -0.1412246 0.0046587 -0.0593555 -0.0422188 0.0058948 0.1000306 -0.0016191 0.1154749 0.0355295 -0.0036358 -0.0006891 -0.0015335 0.1397164 0.1388512 -0.0443792 -0.0015848 0.0050125 -0.0073144 -0.0035078 0.0025307 -0.0052918 0.151135 0.0665594 -0.0318715 -0.0026977 -0.0581305 -0.108253 -0.0082254 -0.0035834 -0.0075931 0.1588239 -0.0544594 0.0914046 -0.0000896 0.1071098 0.0047789 -0.0028245 -0.0002273 -0.0021015 0.1579072 -0.1033246 -0.0663477 -0.0063533 -0.0678862 0.0721953 -0.0034759 -0.0062381 -0.0033626 0.1567873 0.2990737 0.0568078 -0.0325791 0.1185143 0.1756081 0.112155 -0.0603228 0.0998982 0.3283368 unknown
polarizability: 177.4841396|9.2188259|127.9193133|2.0686947|-4.6828817|69.5542797 unknown
InChI: InChI=1S/C11H12O3/c1-8(11(13)14)7-10(12)9-5-3-2-4-6-9/h2-6,8,13H,7H2,1H3
charge 0 multiplicity 1
26 atoms
O  -0.006617 -1.985769 -0.190403
O  -4.711663 -0.12425 -0.294486
O  -3.307528 1.60461 -0.926312
C  -2.342212 -0.459302 0.071725
C  -0.975551 0.24584 -0.026214
C  0.196001 -0.738341 -0.084421
C  -2.634855 -0.991714 1.500225
C  1.595303 -0.193565 -0.036034
C  -3.445051 0.463207 -0.427009
C  1.871764 1.200233 0.011241
C  2.678637 -1.114736 -0.04726
C  3.20519 1.660768 0.047115
C  4.008796 -0.654303 -0.008103
C  4.27564 0.736034 0.039339
H  -2.328751 -1.340536 -0.602474
H  -0.945118 0.888733 -0.92907
H  -0.841719 0.936361 0.829124
H  -3.60952 -1.503966 1.536474
H  -1.848977 -1.710691 1.785708
H  -2.64643 -0.16684 2.236417
H  1.053845 1.928127 0.013245
H  2.444617 -2.183766 -0.088462
H  3.41104 2.736107 0.080162
H  4.837349 -1.370787 -0.01522
H  5.310288 1.095757 0.068802
H  -5.397376 0.501592 -0.654207
