program: Orca
programVersion: 5.0.2
elementType: Cl Cl O O O N C C C C C C C C C C C C C C C C C C C C C C H H H H H H H H H H H H H H H H H H H
charge: 0
multiplicity: 1
keywords: wb97x-d3
keywords: def2-TZVPP
keywords: def2/J RIJCOSX
keywords: DEFGRID2
keywords: scfconv7
keywords: smallprint printgap noloewdin
keywords: NOSOSCF
formula: C22H19Cl2NO3
InChI: InChI=1/C22H19Cl2NO3/c1-22(2)17(12-19(23)24)20(22)21(26)28-18(13-25)14-7-6-10-16(11-14)27-15-8-4-3-5-9-15/h3-12,17-18,20H,1-2H3
47 atoms
Cl -2.613491 0.128045 -1.073236
Cl -4.321763 0.364582 1.235161
O  1.788075 1.763513 -0.322927
O  2.476096 2.1479 1.764418
O  0.619734 -3.061057 0.862453
N  3.075321 0.732882 -3.17104
C  -0.452007 3.813327 0.377253
C  -0.916001 2.389818 0.286937
C  0.26038 2.744224 1.181653
C  0.188164 4.420752 -0.846475
C  -1.242934 4.813708 1.184949
C  -2.145392 1.892849 0.914729
C  1.612964 2.215582 0.927851
C  -2.913715 0.930596 0.417979
C  2.970093 1.02287 -0.576509
C  2.943727 -0.341228 0.079062
C  3.018155 0.872783 -2.032674
C  1.756114 -1.063516 0.117334
C  4.109404 -0.858236 0.622774
C  1.75104 -2.319498 0.708001
C  4.088533 -2.11834 1.203749
C  2.916418 -2.853536 1.245867
C  -0.373531 -3.094184 -0.077789
C  -0.128483 -3.027862 -1.443501
C  -1.663806 -3.281348 0.401535
C  -1.193988 -3.14412 -2.326253
C  -2.714022 -3.41069 -0.493291
C  -2.486321 -3.33966 -1.86051
H  -0.646401 1.90023 -0.640684
H  0.055881 2.784945 2.245786
H  -0.575147 4.917709 -1.4481
H  0.679777 3.692021 -1.487513
H  0.925282 5.174263 -0.563027
H  -0.617381 5.670235 1.441941
H  -1.627959 4.403353 2.117689
H  -2.091355 5.184241 0.60669
H  -2.440519 2.315786 1.867577
H  3.864838 1.574853 -0.269369
H  0.844699 -0.651735 -0.299031
H  5.025473 -0.281856 0.598531
H  4.992533 -2.530682 1.631807
H  2.895578 -3.834611 1.703318
H  0.875438 -2.895837 -1.826791
H  -1.838229 -3.3347 1.468997
H  -1.003045 -3.090336 -3.390419
H  -3.717055 -3.561414 -0.115354
H  -3.308681 -3.434491 -2.557289
elementType: Cl O N C H
totalener: -2050.68257892 hartree
nucrepener: 2929.72120328 hartree
electener: -4980.40378220 hartree
oneelecener: -8635.08668006 hartree
twoeener: 3654.68289786 hartree
cpcmener: -0.03171715 hartree
kineticenergy: 2044.47100267 hartree
xcener: -151.866541920248 hartree
chargesum: -0.0000000
charge: -0.056440 -0.064570 -0.283272 -0.427257 -0.322695 -0.086010 0.084542 0.043644 -0.068839 -0.257475 -0.271334 -0.219940 0.378663 0.062736 0.375784 0.029706 -0.228406 -0.206382 -0.214875 0.294865 -0.101299 -0.247476 0.337861 -0.223905 -0.277954 -0.127978 -0.112550 -0.200064 0.084075 0.098588 0.097029 0.093791 0.099342 0.098705 0.091282 0.102132 0.130401 0.147292 0.131549 0.144280 0.158067 0.147453 0.155294 0.143690 0.158680 0.154301 0.154967
qa: -0.0564 -0.0646 -0.2833 -0.4273 -0.3227 -0.0860 0.0845 0.0436 -0.0688 -0.2575 -0.2713 -0.2199 0.3787 0.0627 0.3758 0.0297 -0.2284 -0.2064 -0.2149 0.2949 -0.1013 -0.2475 0.3379 -0.2239 -0.2780 -0.1280 -0.1125 -0.2001 0.0841 0.0986 0.0970 0.0938 0.0993 0.0987 0.0913 0.1021 0.1304 0.1473 0.1315 0.1443 0.1581 0.1475 0.1553 0.1437 0.1587 0.1543 0.1550
va: 1.2774 1.2407 2.1099 2.0826 2.0946 3.1064 3.7691 3.8111 3.8262 3.9079 3.9142 3.9141 4.1992 4.1920 3.7580 3.6154 4.0663 3.9789 3.9929 3.7197 3.8873 4.0073 3.6314 3.9138 3.9858 3.8579 3.8461 3.8791 1.0416 1.0280 1.0002 1.0112 1.0006 1.0013 1.0055 1.0004 1.0199 1.0143 1.0136 1.0026 0.9893 1.0062 0.9983 1.0094 0.9896 0.9904 0.9917
dispcorr: -0.027984178 hartree
energy: -2050.710563099518
dipole: 11.90100 -12.14867 -0.24767 12.10567 -11.07416 1.03150 0.83775 0.06477 0.90253
magnitude: 1.39280 au
magnitude: 3.54022 debye
