program: Orca
programVersion: 5.0.2
elementType: Cl Cl O O O N C C C C C C C C C C C C C C C C C C C C C C H H H H H H H H H H H H H H H H H H H
charge: 0
multiplicity: 1
keywords: wb97x-d3
keywords: def2-TZVPP
keywords: def2/J RIJCOSX
keywords: DEFGRID2
keywords: scfconv7
keywords: smallprint printgap noloewdin
keywords: NOSOSCF
formula: C22H19Cl2NO3
InChI: InChI=1/C22H19Cl2NO3/c1-22(2)17(12-19(23)24)20(22)21(26)28-18(13-25)14-7-6-10-16(11-14)27-15-8-4-3-5-9-15/h3-12,17-18,20H,1-2H3
47 atoms
Cl -0.222668 0.22809 2.316535
Cl -1.943708 1.43099 4.303244
O  2.010641 1.804711 -0.516011
O  0.327497 0.950789 -1.707133
O  0.539123 -3.554915 -0.372035
N  3.087066 0.44638 -3.498455
C  -1.357738 3.331983 -0.556596
C  -1.501474 2.139862 0.319793
C  -0.109009 2.625254 -0.053892
C  -1.782171 3.22427 -2.000224
C  -1.583908 4.702812 0.033838
C  -1.927689 2.208935 1.733431
C  0.714584 1.718528 -0.863857
C  -1.436416 1.398227 2.66056
C  2.886838 0.753525 -0.911779
C  2.564669 -0.51591 -0.159852
C  2.942617 0.578871 -2.366682
C  1.748759 -1.501695 -0.697124
C  3.029738 -0.624974 1.146209
C  1.355431 -2.568713 0.099371
C  2.662166 -1.716893 1.91629
C  1.809386 -2.683616 1.405614
C  -0.475461 -3.23384 -1.237168
C  -1.30546 -2.140735 -1.016525
C  -0.679019 -4.071112 -2.323847
C  -2.336449 -1.883083 -1.907123
C  -1.725534 -3.81012 -3.19809
C  -2.551632 -2.712701 -3.000015
H  -1.798928 1.226806 -0.191105
H  0.432386 3.150771 0.724142
H  -1.17327 3.870227 -2.635041
H  -2.819094 3.550704 -2.098384
H  -1.721762 2.211732 -2.391676
H  -2.646519 4.953222 0.023657
H  -1.060994 5.460811 -0.551551
H  -1.232017 4.782976 1.06298
H  -2.687623 2.924532 2.025497
H  3.876256 1.107378 -0.613765
H  1.408726 -1.439264 -1.72243
H  3.673277 0.140854 1.561026
H  3.027151 -1.80883 2.930678
H  1.500092 -3.524475 2.013597
H  -1.15507 -1.494251 -0.160905
H  -0.025625 -4.920194 -2.481485
H  -2.979043 -1.028294 -1.738936
H  -1.885482 -4.46563 -4.044481
H  -3.35932 -2.506604 -3.689924
elementType: Cl O N C H
totalener: -2050.67998498 hartree
nucrepener: 2981.19839668 hartree
electener: -5031.87838166 hartree
oneelecener: -8738.73088335 hartree
twoeener: 3706.85250169 hartree
cpcmener: -0.03230652 hartree
kineticenergy: 2044.49207126 hartree
xcener: -151.870906029737 hartree
chargesum: 0.0000000
charge: -0.055118 -0.056092 -0.281440 -0.442797 -0.329342 -0.083457 0.150190 -0.065041 -0.066124 -0.271882 -0.281346 -0.225663 0.367317 0.099928 0.454185 -0.009723 -0.243071 -0.151570 -0.244237 0.243386 -0.124259 -0.226131 0.272280 -0.172186 -0.229824 -0.163634 -0.133282 -0.167244 0.113746 0.106625 0.100409 0.095477 0.093035 0.102190 0.100236 0.093065 0.141537 0.141268 0.141418 0.140864 0.157350 0.146618 0.142261 0.145942 0.159296 0.157383 0.157455
qa: -0.0551 -0.0561 -0.2814 -0.4428 -0.3293 -0.0835 0.1502 -0.0650 -0.0661 -0.2719 -0.2813 -0.2257 0.3673 0.0999 0.4542 -0.0097 -0.2431 -0.1516 -0.2442 0.2434 -0.1243 -0.2261 0.2723 -0.1722 -0.2298 -0.1636 -0.1333 -0.1672 0.1137 0.1066 0.1004 0.0955 0.0930 0.1022 0.1002 0.0931 0.1415 0.1413 0.1414 0.1409 0.1574 0.1466 0.1423 0.1459 0.1593 0.1574 0.1575
va: 1.3037 1.2511 2.1303 2.0447 2.0864 3.1081 3.7298 3.9016 3.8160 3.8903 3.9092 3.8988 4.1408 4.1661 3.8758 3.5881 4.0671 3.8984 3.9731 3.7856 3.8584 3.9836 3.7043 3.8774 3.9966 3.9054 3.8923 3.8969 1.0145 1.0267 0.9995 1.0012 1.0177 0.9991 1.0029 0.9995 1.0084 0.9937 1.0203 1.0051 0.9901 1.0053 1.0029 1.0071 0.9893 0.9889 0.9902
dispcorr: -0.029866333 hartree
energy: -2050.709851315075
dipole: -7.47968 6.81693 -0.66275 8.94174 -7.34456 1.59719 -20.18914 22.02337 1.83423
magnitude: 2.52084 au
magnitude: 6.40746 debye
