program: Orca
programVersion: 5.0.2
elementType: Cl Cl O O O N C C C C C C C C C C C C C C C C C C C C C C H H H H H H H H H H H H H H H H H H H
charge: 0
multiplicity: 1
keywords: wb97x-d3
keywords: def2-TZVPP
keywords: def2/J RIJCOSX
keywords: DEFGRID2
keywords: scfconv7
keywords: smallprint printgap noloewdin
keywords: NOSOSCF
formula: C22H19Cl2NO3
InChI: InChI=1/C22H19Cl2NO3/c1-22(2)17(12-19(23)24)20(22)21(26)28-18(13-25)14-7-6-10-16(11-14)27-15-8-4-3-5-9-15/h3-12,17-18,20H,1-2H3
47 atoms
Cl -4.43906 3.822773 -0.830507
Cl -3.450139 6.48203 -0.30678
O  1.131985 1.125388 0.801791
O  -0.75328 0.315659 -0.081677
O  1.432058 -4.674927 -0.529267
N  3.231363 0.24313 3.189442
C  -0.269745 2.745018 -2.046451
C  -1.394912 3.050461 -1.100211
C  -0.067329 2.566283 -0.5531
C  -0.423866 1.54667 -2.950245
C  0.510643 3.867611 -2.685793
C  -1.809124 4.42648 -0.801043
C  0.020634 1.227254 0.052247
C  -3.062052 4.842354 -0.66719
C  1.391508 -0.146883 1.374942
C  1.88429 -1.151439 0.357767
C  2.424065 0.091156 2.386961
C  1.399132 -2.449243 0.406898
C  2.822955 -0.776801 -0.595984
C  1.884226 -3.390728 -0.493386
C  3.274035 -1.720507 -1.505208
C  2.81916 -3.02899 -1.453094
C  1.083082 -5.334022 0.619073
C  1.820467 -5.227233 1.792296
C  -0.014713 -6.179905 0.546798
C  1.435874 -5.966135 2.902097
C  -0.377935 -6.923604 1.660507
C  0.33892 -6.815195 2.843923
H  -2.185458 2.308551 -1.091431
H  0.566509 3.312839 -0.087935
H  -1.080019 0.779358 -2.545646
H  0.545223 1.088696 -3.158399
H  -0.84859 1.865563 -3.90383
H  1.480545 3.501571 -3.026771
H  0.698233 4.701179 -2.01046
H  -0.021994 4.254695 -3.556475
H  -1.033747 5.171736 -0.669131
H  0.50929 -0.534618 1.895672
H  0.649064 -2.715994 1.141694
H  3.204539 0.235562 -0.634225
H  4.001455 -1.440451 -2.255573
H  3.182486 -3.767893 -2.156202
H  2.688666 -4.582489 1.848328
H  -0.575143 -6.258974 -0.376433
H  2.008303 -5.880634 3.81677
H  -1.232744 -7.584949 1.600706
H  0.048146 -7.390675 3.712855
elementType: Cl O N C H
totalener: -2050.68676967 hartree
nucrepener: 2677.53363168 hartree
electener: -4728.22040136 hartree
oneelecener: -8130.36964358 hartree
twoeener: 3402.14924223 hartree
cpcmener: -0.03176852 hartree
kineticenergy: 2044.46923578 hartree
xcener: -151.863511864576 hartree
chargesum: -0.0000000
charge: -0.054715 -0.059777 -0.280543 -0.434775 -0.324647 -0.087081 0.088805 0.031462 -0.070799 -0.263994 -0.264293 -0.203308 0.370293 0.040325 0.403801 0.028843 -0.226831 -0.196478 -0.232088 0.275679 -0.122159 -0.224528 0.296706 -0.205021 -0.254412 -0.138122 -0.116708 -0.189202 0.080780 0.098971 0.096347 0.096677 0.100028 0.098278 0.091739 0.101678 0.130186 0.141521 0.145149 0.147210 0.158257 0.148358 0.157066 0.145897 0.159505 0.157783 0.158135
qa: -0.0547 -0.0598 -0.2805 -0.4348 -0.3246 -0.0871 0.0888 0.0315 -0.0708 -0.2640 -0.2643 -0.2033 0.3703 0.0403 0.4038 0.0288 -0.2268 -0.1965 -0.2321 0.2757 -0.1222 -0.2245 0.2967 -0.2050 -0.2544 -0.1381 -0.1167 -0.1892 0.0808 0.0990 0.0963 0.0967 0.1000 0.0983 0.0917 0.1017 0.1302 0.1415 0.1451 0.1472 0.1583 0.1484 0.1571 0.1459 0.1595 0.1578 0.1581
va: 1.2709 1.2448 2.1246 2.0797 2.0874 3.1126 3.7415 3.8782 3.8291 3.9048 3.9060 3.8978 4.2214 4.2134 3.7243 3.5981 4.0771 3.9764 3.9605 3.7406 3.9104 4.0055 3.6834 3.9170 4.0128 3.8878 3.8797 3.9108 1.0478 1.0326 1.0175 1.0011 1.0009 1.0015 1.0054 1.0011 1.0183 1.0187 1.0061 1.0125 0.9894 1.0052 0.9970 1.0085 0.9901 0.9891 0.9905
dispcorr: -0.023382737 hartree
energy: -2050.710152409515
dipole: 22.61641 -22.21793 0.39848 -26.26006 26.21582 -0.04424 -9.09049 7.80428 -1.28621
magnitude: 1.34725 au
magnitude: 3.42444 debye
