program: Orca
programVersion: 5.0.2
elementType: Cl Cl O O O N C C C C C C C C C C C C C C C C C C C C C C H H H H H H H H H H H H H H H H H H H
charge: 0
multiplicity: 1
keywords: wb97x-d3
keywords: def2-TZVPP
keywords: def2/J RIJCOSX
keywords: DEFGRID2
keywords: scfconv7
keywords: smallprint printgap noloewdin
keywords: NOSOSCF
formula: C22H19Cl2NO3
InChI: InChI=1/C22H19Cl2NO3/c1-22(2)17(12-19(23)24)20(22)21(26)28-18(13-25)14-7-6-10-16(11-14)27-15-8-4-3-5-9-15/h3-12,17-18,20H,1-2H3
47 atoms
Cl -1.33859 6.139688 0.931063
Cl -2.760331 6.667321 -1.524077
O  1.134713 0.57785 -1.472788
O  1.373881 1.703617 0.44556
O  -0.242682 -3.862024 0.467014
N  3.168779 -1.116913 -3.461556
C  -1.763754 1.865996 0.127571
C  -1.12586 3.198193 -0.144582
C  -0.616705 1.969168 -0.86119
C  -1.551743 1.240771 1.48537
C  -3.119868 1.555716 -0.459661
C  -1.809929 4.243543 -0.919293
C  0.720818 1.441905 -0.524931
C  -1.946849 5.510541 -0.546461
C  2.339234 -0.118031 -1.194118
C  2.134635 -1.217031 -0.177145
C  2.784813 -0.672503 -2.474652
C  1.054852 -2.078999 -0.310577
C  3.0295 -1.369892 0.86971
C  0.867626 -3.092322 0.617177
C  2.840808 -2.396329 1.782922
C  1.763649 -3.258473 1.669081
C  -0.211473 -5.177837 0.839879
C  -1.243351 -5.648803 1.636421
C  0.786489 -6.0344 0.392823
C  -1.278564 -6.991099 1.983766
C  0.744222 -7.371202 0.7551
C  -0.285103 -7.855555 1.550391
H  -0.477044 3.556031 0.646873
H  -0.89568 1.850488 -1.902505
H  -1.574153 0.151498 1.418171
H  -2.355745 1.547758 2.155885
H  -0.609818 1.528777 1.945088
H  -3.28056 0.477153 -0.489456
H  -3.246426 1.930133 -1.474781
H  -3.908669 1.993814 0.153895
H  -2.241682 3.974294 -1.875798
H  3.112848 0.571172 -0.839184
H  0.352587 -1.97544 -1.128742
H  3.86234 -0.688038 0.98144
H  3.531905 -2.518202 2.606107
H  1.619001 -4.046319 2.396605
H  -2.013961 -4.967357 1.971997
H  1.58486 -5.663076 -0.237407
H  -2.086687 -7.359064 2.602108
H  1.51957 -8.039694 0.404853
H  -0.31365 -8.900777 1.826497
totalener: -2050.66102024 hartree
nucrepener: 2679.88745604 hartree
electener: -4730.54847628 hartree
oneelecener: -8134.97814856 hartree
twoeener: 3404.42967228 hartree
kineticenergy: 2044.52655604 hartree
xcener: -151.868790310557 hartree
chargesum: 0.0000000
charge: -0.038719 -0.043501 -0.269073 -0.358180 -0.299508 0.000232 0.068061 0.041545 -0.083290 -0.245035 -0.238180 -0.202095 0.311738 0.047026 0.322363 0.057631 -0.257905 -0.229745 -0.138622 0.199452 -0.109352 -0.143816 0.210921 -0.192162 -0.144043 -0.101872 -0.121065 -0.132632 0.089095 0.082512 0.088283 0.091332 0.102637 0.095718 0.072624 0.099952 0.099876 0.123511 0.123247 0.108192 0.129606 0.135832 0.124918 0.137780 0.127195 0.129869 0.127642
qa: -0.0387 -0.0435 -0.2691 -0.3582 -0.2995 0.0002 0.0681 0.0415 -0.0833 -0.2450 -0.2382 -0.2021 0.3117 0.0470 0.3224 0.0576 -0.2579 -0.2297 -0.1386 0.1995 -0.1094 -0.1438 0.2109 -0.1922 -0.1440 -0.1019 -0.1211 -0.1326 0.0891 0.0825 0.0883 0.0913 0.1026 0.0957 0.0726 0.1000 0.0999 0.1235 0.1232 0.1082 0.1296 0.1358 0.1249 0.1378 0.1272 0.1299 0.1276
va: 1.2886 1.2619 2.1195 2.1459 2.0954 3.1210 3.7695 3.8338 3.8594 3.9121 3.9044 3.9088 4.2843 4.2479 3.8228 3.6510 4.0260 4.0515 4.0284 3.8731 3.9686 3.9388 3.8297 4.0322 3.9458 3.9417 3.9455 3.9511 1.0485 1.0358 1.0022 1.0024 1.0196 1.0043 1.0097 1.0031 1.0278 1.0183 1.0322 1.0135 1.0011 1.0031 1.0130 1.0021 0.9989 0.9996 0.9999
dispcorr: -0.023522072 hartree
energy: -2050.684542314018
dipole: -0.57927 -0.13694 -0.71622 -42.11250 41.16313 -0.94936 11.02066 -9.77701 1.24365
magnitude: 1.72073 au
magnitude: 4.37375 debye
