program: Orca
programVersion: 5.0.2
elementType: Cl Cl O O O N C C C C C C C C C C C C C C C C C C C C C C H H H H H H H H H H H H H H H H H H H
charge: 0
multiplicity: 1
keywords: wb97x-d3
keywords: def2-TZVPP
keywords: def2/J RIJCOSX
keywords: DEFGRID2
keywords: scfconv7
keywords: smallprint printgap noloewdin
keywords: NOSOSCF
formula: C22H19Cl2NO3
InChI: InChI=1/C22H19Cl2NO3/c1-22(2)17(12-19(23)24)20(22)21(26)28-18(13-25)14-7-6-10-16(11-14)27-15-8-4-3-5-9-15/h3-12,17-18,20H,1-2H3
47 atoms
Cl -1.364619 6.044332 1.052676
Cl -2.764954 6.659891 -1.393344
O  1.208964 0.620203 -1.490775
O  1.381598 1.702624 0.459275
O  -0.226288 -3.796545 0.423837
N  3.286353 -1.066125 -3.441691
C  -1.759709 1.777841 0.042197
C  -1.148937 3.140174 -0.125719
C  -0.579141 1.96946 -0.892122
C  -1.578784 1.079752 1.368169
C  -3.082863 1.466315 -0.614828
C  -1.826673 4.21405 -0.865333
C  0.757896 1.455664 -0.533997
C  -1.961148 5.467887 -0.450671
C  2.409987 -0.07209 -1.189792
C  2.187757 -1.177272 -0.182996
C  2.883953 -0.619715 -2.463008
C  1.099897 -2.026238 -0.331613
C  3.072701 -1.348216 0.86956
C  0.89329 -3.043492 0.587503
C  2.865287 -2.379432 1.773392
C  1.778721 -3.227812 1.645265
C  -0.216957 -5.118018 0.776051
C  -1.275383 -5.589239 1.53703
C  0.781971 -5.979529 0.340757
C  -1.336249 -6.936575 1.860075
C  0.713681 -7.321682 0.678958
C  -0.342421 -7.806329 1.437947
H  -0.540082 3.466275 0.709942
H  -0.815101 1.904308 -1.948643
H  -1.570422 -0.00426 1.237708
H  -2.412916 1.328312 2.026416
H  -0.660453 1.362399 1.877301
H  -3.209918 0.387507 -0.715552
H  -3.182175 1.898079 -1.60998
H  -3.906804 1.844168 -0.007225
H  -2.251869 3.980874 -1.833827
H  3.173674 0.618103 -0.815482
H  0.405056 -1.908549 -1.154129
H  3.911971 -0.676297 0.993454
H  3.548583 -2.515275 2.601153
H  1.618447 -4.018618 2.366245
H  -2.046053 -4.903645 1.863769
H  1.600967 -5.60841 -0.262415
H  -2.16508 -7.304531 2.450227
H  1.489606 -7.994111 0.337454
H  -0.391302 -8.855708 1.694709
totalener: -2050.66088267 hartree
nucrepener: 2686.36175208 hartree
electener: -4737.02263475 hartree
oneelecener: -8147.91676144 hartree
twoeener: 3410.89412669 hartree
kineticenergy: 2044.52875928 hartree
xcener: -151.869297094227 hartree
chargesum: -0.0000000
charge: -0.038641 -0.043886 -0.268312 -0.355222 -0.300780 0.000084 0.065683 0.045284 -0.077576 -0.245087 -0.239940 -0.204264 0.305436 0.048375 0.321334 0.067563 -0.257272 -0.241880 -0.141207 0.208901 -0.107129 -0.147006 0.213758 -0.194562 -0.146729 -0.101076 -0.120893 -0.133360 0.088247 0.082541 0.088014 0.092379 0.102036 0.095384 0.072861 0.100072 0.098934 0.124067 0.123065 0.107722 0.129686 0.136201 0.124770 0.137869 0.127160 0.129788 0.127611
qa: -0.0386 -0.0439 -0.2683 -0.3552 -0.3008 0.0001 0.0657 0.0453 -0.0776 -0.2451 -0.2399 -0.2043 0.3054 0.0484 0.3213 0.0676 -0.2573 -0.2419 -0.1412 0.2089 -0.1071 -0.1470 0.2138 -0.1946 -0.1467 -0.1011 -0.1209 -0.1334 0.0882 0.0825 0.0880 0.0924 0.1020 0.0954 0.0729 0.1001 0.0989 0.1241 0.1231 0.1077 0.1297 0.1362 0.1248 0.1379 0.1272 0.1298 0.1276
va: 1.2887 1.2613 2.1180 2.1486 2.0909 3.1207 3.7727 3.8339 3.8462 3.9118 3.9040 3.9142 4.2952 4.2495 3.8216 3.6401 4.0257 4.0499 4.0335 3.8571 3.9666 3.9453 3.8287 4.0345 3.9444 3.9424 3.9463 3.9518 1.0494 1.0353 1.0024 1.0024 1.0191 1.0045 1.0097 1.0028 1.0288 1.0178 1.0325 1.0135 1.0010 1.0028 1.0132 1.0023 0.9989 0.9996 0.9999
dispcorr: -0.023690202 hartree
energy: -2050.684572867794
dipole: -0.69641 -0.03912 -0.73553 -42.38873 41.42205 -0.96668 9.51922 -8.33801 1.18122
magnitude: 1.69433 au
magnitude: 4.30664 debye
