program: Gaussian 09
title: 000074489
version: EM64L-G09RevD.01
frameworkgroup: C1[X(C6H13N3O)]
method: RPBEPBE
basis: SDD
operation: Freq
keyword: #p
keyword: freq=noraman
keyword: PBEPBE/SDD
title: #p freq=noraman PBEPBE/SDD
converged: YES YES NO NO
title: Mulliken charges:
elementType: O N N N C C C C C C H H H H H H H H H H H H H
charge: -0.310590 -0.095736 -0.374293 -0.370902 -0.304722 -0.316705 -0.316283 -0.383112 0.183004 -0.682457 0.177169 0.205301 0.235132 0.193885 0.197976 0.231046 0.225188 0.200466 0.330009 0.330866 0.209104 0.211451 0.224199
chargesum: 0.00000
title: Mulliken charges with hydrogens summed into heavy atoms:
elementType: O N N N C C C C C C
charge: -0.310590 -0.095736 -0.044284 -0.040035 0.077748 0.112312 0.112740 0.042543 0.183004 -0.037702
polarizability: 1.13445440e+02 -1.27588872e+00 8.40715198e+01 -6.31828394e+00 -6.53463973e-01 6.47706412e+01
1716.lowfreq: -10.0534 -1.2870 -0.0009 -0.0009 -0.0005 5.3297 56.2721 69.4922 94.5127
frequency: 56.2495 69.2680 94.4751 116.3006 150.3508 220.5706 239.5489 289.5898 326.0148 362.4610 409.5928 442.6721 494.2444 521.0390 572.5303 703.4496 730.5527 755.0279 814.7084 880.1919 901.0224 925.7446 1011.7792 1022.6101 1042.9417 1071.6707 1113.3326 1121.4305 1154.0655 1162.8831 1180.3586 1216.4032 1247.5488 1275.7515 1284.4613 1302.9275 1320.1900 1363.6021 1377.6378 1394.0145 1402.7770 1416.9401 1460.1382 1469.1639 1475.3169 1479.3989 1486.9714 1492.9482 1499.0926 1665.6880 2796.2445 2809.5702 2840.8082 2976.4391 2986.7289 3011.4661 3029.1925 3043.8779 3050.1894 3075.1124 3080.7915 3599.2899 3602.7225
redmass: 4.5745 1.6709 2.4231 2.8583 4.5197 1.2374 2.1396 3.6113 2.3895 2.9593 1.3422 4.8902 1.1826 3.8050 5.4917 8.5131 3.6898 1.1205 5.7893 1.2327 1.8887 3.1520 1.6183 2.2339 3.0300 2.2321 2.2170 1.9969 2.9121 2.1350 2.6403 1.1600 1.2834 1.2563 1.3468 1.2128 1.5587 1.5018 1.6888 1.2260 1.3329 1.4730 1.7845 1.1374 1.0626 1.0428 1.0795 1.2734 1.1089 4.7964 1.0724 1.0713 1.0702 1.0359 1.0631 1.0853 1.0879 1.0983 1.0894 1.1014 1.0992 1.0770 1.0789
irintensity: 0.8514 0.2780 0.1770 0.9825 2.7778 1.2007 4.1194 1.4881 2.9650 6.0521 5.3389 17.5861 207.7812 23.1779 0.4255 66.9654 6.5307 9.8395 10.8685 0.6570 10.4256 20.5357 10.8972 4.5136 6.4932 18.0931 29.0538 5.6596 4.6967 129.1140 0.8244 0.5026 5.1656 12.9386 40.1785 24.7296 40.2563 34.3829 6.1168 19.6827 6.1358 41.3696 109.8230 12.7097 4.9159 14.0999 13.0477 58.3875 3.2810 507.1399 63.5501 132.5574 179.3100 38.3285 17.4690 20.5263 40.0360 9.3464 26.0507 80.0791 44.6537 65.6510 15.3996
temp: 298.150 k
press: 1.00000 atm
elementType: 8 7 7 7 6 6 6 6 6 6 1 1 1 1 1 1 1 1 1 1 1 1 1
symmnumber: 1
zpe: 517325.6 jmol-1
zpe.correction: 0.197039 hartree
zpe.thermalcorrener: 0.207890 hartree
zpe.thermalcorrenthalpy: 0.208834 hartree
zpe.thermalcorrgfe: 0.160180 hartree
zpe.sumelectzpe: -475.105155 hartree
zpe.sumelectthermal: -475.094304 hartree
zpe.sumelectthermalent: -475.093360 hartree
zpe.sumelectthermalfe: -475.142014 hartree
dipole: -5.2867 0.9426 1.7625
dipole: 5.6520
quadrupole: -80.2631 -51.0155 -63.5607
quadrupole: 3.9611 2.9885 -1.7537
quadrupole: -15.3167 13.9309 1.3858 3.9611 2.9885 -1.7537
hfenergy: -475.3021937 hartree
pointgroup: C01 [X(C6H13N3O1)]
dipole: -2.0735632 -0.365968 -0.7148543 debye
dipolederiv: -1.3764483 -0.133164 -0.2633003 -0.1453367 -0.6208075 -0.02201 -0.2953322 -0.0239323 -0.4939352 -0.8077129 0.0034018 -0.0363097 0.0022985 -0.4679028 -0.0285629 0.0376741 -0.0079853 -0.5600956 -0.9232217 0.2437204 -0.1324144 0.3640647 -0.641043 0.1693334 -0.0820897 0.1720355 -0.5962219 -0.7460129 -0.252719 -0.012894 -0.3441551 -0.913945 -0.1278605 0.0639475 -0.1056556 -0.5078964 0.6064366 0.0565169 0.0840663 0.0600055 0.1277833 -0.005063 0.0764679 0.0012346 0.397891 0.6594688 0.0789833 0.0786444 0.2727842 0.3599069 -0.0350762 0.0393917 -0.0429906 0.71605 0.7280444 0.0183728 0.0693563 -0.1966804 0.4045912 0.1462408 0.0905983 0.1498283 0.6541136 -0.0373636 0.0072843 0.0029787 0.0155194 0.098139 -0.0296984 -0.0515557 -0.0497855 0.1099379 1.8179419 0.0747257 0.4386029 0.0594961 1.5958232 -0.1070683 0.3856091 -0.1146449 0.4276697 -0.0516805 -0.0071684 0.0028838 0.0286393 0.0707459 -0.0167978 0.0299321 -0.0173691 0.0903618 -0.0856654 -0.0046155 -0.0018233 0.0103086 0.0403321 -0.013992 -0.1467661 -0.0671947 -0.2577748 0.0193689 -0.0236247 0.0054841 -0.0702269 -0.1286438 0.0600181 0.0092069 0.082133 0.0364949 -0.002604 0.1114821 -0.010074 0.1288857 -0.0724531 -0.0259965 0.0128009 -0.0466991 0.0385515 -0.0862761 -0.0031731 -0.0613421 -0.088163 0.012354 -0.0733097 -0.0629114 0.0922604 -0.3043932 -0.0961056 -0.0318585 -0.0546194 0.0553431 -0.0131728 -0.0236038 -0.032321 -0.1945519 -0.2754224 0.0152009 -0.0972962 0.0174411 -0.0740841 -0.0967428 0.0566542 0.0261612 0.0914281 0.0156043 0.0442889 -0.0098349 -0.0674587 0.0040031 0.0673738 -0.0245827 -0.0325946 -0.0453308 -0.1363655 0.0427893 -0.0662061 0.028146 -0.0552311 -0.1422194 0.0702768 0.0456222 0.0984855 0.029693 0.1176594 -0.0030249 -0.0619146 0.0078007 0.1857286 0.0075581 -0.0599185 -0.0123876 0.3419593 0.1261309 -0.0280441 -0.0612945 -0.0409989 0.1890304 0.017812 -0.0588525 0.0345843 0.3355795 0.0631826 -0.0133403 -0.0214255 -0.0365163 0.085326 -0.0280184 -0.0914685 -0.0303304 -0.1678477 0.051543 -0.0185603 -0.0012624 -0.0942199 -0.1157585 0.1049976 0.0194259 0.1052569 0.0402966 -0.0789648 0.0981427 0.0585292 0.1364636 -0.0244455 -0.0712508 0.0769724 -0.0683888 0.0657499 unknown
polarizability: 113.3013505|1.185481|84.04449|6.8817785|-0.8492416|64.9417604 unknown
InChI: InChI=1S/C6H13N3O/c1-2-3-9-4-7-6(10)8-5-9/h7-8H,2-5H2,1H3
charge 0 multiplicity 1
23 atoms
O  3.546121 0.376846 0.527806
N  -0.443542 -0.243934 0.074406
N  1.482546 1.175639 -0.229917
N  1.802491 -1.123081 0.100979
C  -1.870224 -0.511483 -0.241709
C  0.078022 0.969205 -0.600649
C  0.414466 -1.40055 -0.281522
C  -2.836327 0.531012 0.358218
C  2.353202 0.156014 0.153746
C  -4.311296 0.123308 0.151219
H  -2.043526 -0.58357 -1.348222
H  -2.117635 -1.503069 0.185006
H  -0.511727 1.843801 -0.278079
H  -0.026961 0.87693 -1.71627
H  0.348776 -1.627263 -1.380115
H  0.053193 -2.288771 0.267664
H  -2.612659 0.632874 1.436609
H  -2.669969 1.524845 -0.101405
H  1.852202 2.119855 -0.136087
H  2.404363 -1.873474 0.43477
H  -4.550122 0.009156 -0.923223
H  -4.533014 -0.838825 0.649985
H  -4.995279 0.883636 0.568591
