program: Gaussian 09
title: 000074484
version: EM64L-G09RevD.01
frameworkgroup: C1[X(C7H2BrF5)]
method: RPBEPBE
basis: SDD
operation: Freq
keyword: #p
keyword: freq=noraman
keyword: PBEPBE/SDD
title: #p freq=noraman PBEPBE/SDD
converged: NO NO NO NO
title: Mulliken charges:
elementType: Br F F F F F C C C C C C C H H
charge: 0.022565 -0.146440 -0.146430 -0.141657 -0.141669 -0.137937 0.258689 0.160443 0.160493 0.081516 0.081500 -0.801173 0.129408 0.310349 0.310341
chargesum: 0.00000
title: Mulliken charges with hydrogens summed into heavy atoms:
elementType: Br F F F F F C C C C C C C
charge: 0.022565 -0.146440 -0.146430 -0.141657 -0.141669 -0.137937 0.258689 0.160443 0.160493 0.081516 0.081500 -0.180482 0.129408
polarizability: 1.29801088e+02 4.08580663e-03 9.17672389e+01 -4.38144826e-01 5.28283054e-03 5.68181623e+01
1716.lowfreq: -0.0008 -0.0008 -0.0007 6.4709 8.3960 10.8815 38.0354 56.9593 121.4262
frequency: 38.0073 56.9486 121.4220 122.3481 162.4654 213.0470 251.6960 256.5977 270.3744 285.7006 305.9284 361.5746 372.7230 425.6799 437.9126 525.5902 541.3092 583.9263 633.4953 659.4646 689.3473 748.0487 854.1231 923.8181 946.4938 1071.0673 1087.6196 1157.3205 1231.0721 1243.8699 1364.5667 1388.8014 1452.7022 1456.9029 1462.0660 1601.7128 1615.3952 3074.0160 3156.7794
redmass: 12.9380 21.2450 18.5786 21.0815 19.5283 14.0652 8.6690 18.4342 3.1747 15.3553 14.3537 12.5027 12.6196 14.6610 12.3702 10.6721 10.5067 9.3237 12.1505 9.3877 4.4961 10.5280 2.7287 10.4823 2.7264 7.4761 10.1166 1.2698 1.2470 6.1244 9.4264 10.4335 1.1260 9.8440 11.4638 10.6944 11.7820 1.0571 1.1112
irintensity: 0.5808 0.3217 0.0016 0.4450 0.0972 3.9885 0.9709 0.0440 2.7856 0.6741 3.7272 2.0086 0.0000 0.0003 8.1312 2.4165 20.5079 39.0371 0.0129 6.1108 0.0000 4.1717 28.7496 46.4221 126.3850 2.5623 50.6912 13.7326 20.9915 47.9998 4.7998 46.0163 9.0047 261.3952 105.1993 0.6214 27.4864 4.5093 0.3808
temp: 298.150 k
press: 1.00000 atm
elementType: 35 9 9 9 9 9 6 6 6 6 6 6 6 1 1
symmnumber: 1
zpe: 198292.6 jmol-1
zpe.correction: 0.075526 hartree
zpe.thermalcorrener: 0.087461 hartree
zpe.thermalcorrenthalpy: 0.088405 hartree
zpe.thermalcorrgfe: 0.035499 hartree
zpe.sumelectzpe: -779.633691 hartree
zpe.sumelectthermal: -779.621756 hartree
zpe.sumelectthermalent: -779.620812 hartree
zpe.sumelectthermalfe: -779.673718 hartree
dipole: -0.5020 0.0008 1.9131
dipole: 1.9779
quadrupole: -89.7634 -90.1789 -75.8409
quadrupole: -0.0026 -0.9106 0.0021
quadrupole: -4.5024 -4.9178 9.4202 -0.0026 -0.9106 0.0021
hfenergy: -779.7092169 hartree
pointgroup: C01 [X(C7H2Br1F5)]
dipole: -0.3060917 0.000525 0.7154437 debye
dipolederiv: -0.4869773 0.0002018 -0.1164449 0.0000752 -0.085332 -0.0000322 -0.3903286 0.000162 -0.3068119 -0.3069309 0.3218639 0.0586534 0.2285107 -0.7616585 -0.0912174 0.027817 -0.0583263 -0.112778 -0.3078282 -0.3225485 0.0588921 -0.2292242 -0.760675 0.0913002 0.027847 0.058182 -0.112764 -0.3941103 0.3466629 0.0253874 0.4110439 -0.7405755 -0.0267389 0.0502636 -0.0490121 -0.0814788 -0.3952142 -0.3471449 0.0254816 -0.4115144 -0.7394211 0.0268313 0.0506491 0.04936 -0.0815215 -1.0484076 0.0006841 0.0896897 0.0007059 -0.1550126 -0.0000671 0.1610234 -0.0001032 -0.0894363 -0.2306722 -0.0000205 -0.0259949 0.0000183 -0.2038814 -0.000096 0.1541093 -0.0001464 -0.1385924 0.3610707 -0.4605118 -0.0646699 -0.1582692 0.8376186 0.1203451 -0.0638721 0.0708029 0.1057585 0.3620448 0.4612869 -0.0649952 0.1590714 0.8364701 -0.1203398 -0.0637513 -0.0704285 0.1057243 0.2424769 -0.5367674 -0.0126575 -0.5702338 0.7484744 0.0302912 -0.0211944 0.080232 0.0702688 0.2440684 0.5374659 -0.0128088 0.5709623 0.74676 -0.0304785 -0.02173 -0.0808285 0.0703185 0.7440657 -0.0003439 0.3012202 -0.000324 0.0371381 0.0000154 0.4046614 -0.000096 0.502756 1.1552422 -0.0007816 -0.1261265 -0.0007956 0.1461975 0.0001382 -0.1840807 0.0001794 0.1029047 0.0306339 -0.0133779 -0.0678567 0.0439844 0.0468826 -0.0621487 -0.0657413 -0.0537572 -0.0171149 0.0305381 0.013331 -0.0677699 -0.0440109 0.0470146 0.0621974 -0.0656724 0.05378 -0.0172331 unknown
polarizability: 128.3489349|-0.0157719|91.7672459|10.2012325|-0.0018558|58.2703082 unknown
InChI: InChI=1S/C7H2BrF5/c8-1-2-3(9)5(11)7(13)6(12)4(2)10/h1H2
charge 0 multiplicity 1
15 atoms
Br -3.607315 0.00174 -1.210311
F  -1.04243 2.42016 0.327842
F  -1.046237 -2.418527 0.328233
F  1.701517 -2.422547 -0.116881
F  1.705211 2.41983 -0.117546
F  3.07799 -0.002455 -0.347796
C  -1.105467 0.000869 0.326816
C  -0.374965 1.206755 0.215132
C  -0.376793 -1.206205 0.215534
C  1.014165 -1.222357 -0.01156
C  1.016094 1.220675 -0.011644
C  -2.587842 0.002018 0.555289
C  1.711255 -0.00137 -0.126114
H  -2.928756 0.909788 1.072778
H  -2.929927 -0.904775 1.073729
