program: Orca
programVersion: 5.0.2
elementType: Cl Cl O O O N C C C C C C C C C C C C C C C C C C C C C C H H H H H H H H H H H H H H H H H H H
charge: 0
multiplicity: 1
keywords: wb97x-d3
keywords: def2-TZVPP
keywords: def2/J RIJCOSX
keywords: DEFGRID2
keywords: scfconv7
keywords: smallprint printgap noloewdin
keywords: NOSOSCF
formula: C22H19Cl2NO3
InChI: InChI=1/C22H19Cl2NO3/c1-22(2)17(12-19(23)24)20(22)21(26)28-18(13-25)14-7-6-10-16(11-14)27-15-8-4-3-5-9-15/h3-12,17-18,20H,1-2H3
47 atoms
Cl -0.80924 4.310938 -1.454754
Cl -3.618403 4.919324 -1.738358
O  1.179376 0.472054 -0.890093
O  1.19783 1.626503 1.032795
O  1.482974 -3.964791 1.521599
N  3.505987 0.342302 -3.248272
C  -1.862322 0.800249 0.940349
C  -1.675636 2.251019 0.650756
C  -0.864485 1.241615 -0.122431
C  -1.381101 0.255639 2.262429
C  -3.091299 0.097717 0.415475
C  -2.703784 3.052775 -0.049016
C  0.589905 1.166479 0.108118
C  -2.416319 3.970745 -0.962358
C  2.573133 0.269654 -0.807701
C  2.945043 -1.044293 -0.143687
C  3.075708 0.308208 -2.184137
C  1.971951 -1.89906 0.351938
C  4.290596 -1.364367 -0.029225
C  2.357843 -3.084368 0.969243
C  4.659356 -2.550283 0.58385
C  3.7020 -3.414988 1.082846
C  0.140039 -3.875351 1.287678
C  -0.383746 -4.013121 0.008453
C  -0.696917 -3.711418 2.381162
C  -1.758358 -3.981862 -0.16809
C  -2.071267 -3.693866 2.192958
C  -2.606257 -3.823981 0.920115
H  -1.10182 2.800914 1.392936
H  -1.168574 1.047262 -1.144601
H  -0.518039 0.789274 2.653112
H  -1.118863 -0.800358 2.174499
H  -2.180387 0.333162 3.00167
H  -3.413469 0.479697 -0.553682
H  -3.924136 0.212011 1.112459
H  -2.898128 -0.970326 0.305249
H  -3.745802 2.913029 0.213319
H  3.04522 1.089438 -0.254558
H  0.923506 -1.652631 0.259085
H  5.049894 -0.700152 -0.423201
H  5.706547 -2.806254 0.672679
H  3.984702 -4.340886 1.565569
H  0.275707 -4.152309 -0.838833
H  -0.269464 -3.61255 3.370371
H  -2.168157 -4.093676 -1.163113
H  -2.724279 -3.57447 3.047372
H  -3.678339 -3.811578 0.776367
totalener: -2050.65878288 hartree
nucrepener: 2844.57143589 hartree
electener: -4895.23021877 hartree
oneelecener: -8464.18190366 hartree
twoeener: 3568.95168490 hartree
kineticenergy: 2044.52029201 hartree
xcener: -151.872040709526 hartree
chargesum: 0.0000000
charge: -0.028988 -0.039118 -0.271650 -0.359607 -0.291473 -0.001180 0.148047 -0.026643 -0.153363 -0.229364 -0.278309 -0.242984 0.328887 0.087533 0.314123 0.049980 -0.249579 -0.197854 -0.228500 0.310930 -0.066640 -0.226548 0.260926 -0.188798 -0.198510 -0.087098 -0.101061 -0.177061 0.112336 0.103726 0.108510 0.054531 0.090489 0.090986 0.094140 0.088859 0.118580 0.132978 0.108047 0.118549 0.127898 0.126915 0.138128 0.129280 0.134296 0.129481 0.136173
qa: -0.0290 -0.0391 -0.2717 -0.3596 -0.2915 -0.0012 0.1480 -0.0266 -0.1534 -0.2294 -0.2783 -0.2430 0.3289 0.0875 0.3141 0.0500 -0.2496 -0.1979 -0.2285 0.3109 -0.0666 -0.2265 0.2609 -0.1888 -0.1985 -0.0871 -0.1011 -0.1771 0.1123 0.1037 0.1085 0.0545 0.0905 0.0910 0.0941 0.0889 0.1186 0.1330 0.1080 0.1185 0.1279 0.1269 0.1381 0.1293 0.1343 0.1295 0.1362
va: 1.3041 1.2673 2.1016 2.1388 2.1282 3.1196 3.6883 3.8662 3.8774 3.8805 3.9133 3.9105 4.1941 4.2079 3.7835 3.7477 3.9881 3.9662 4.0684 3.7741 3.9449 4.0454 3.7598 3.9721 3.9852 3.8739 3.8590 3.9061 1.0255 1.0277 1.0229 1.0194 1.0053 1.0034 1.0014 1.0187 1.0166 1.0231 1.0245 1.0127 0.9991 1.0144 1.0024 1.0130 0.9975 0.9990 0.9984
dispcorr: -0.027687181 hartree
energy: -2050.686470059647
dipole: -3.34488 2.04548 -1.29940 -32.13627 31.19540 -0.94087 19.43821 -18.10344 1.33477
magnitude: 2.08694 au
magnitude: 5.30457 debye
