program: Orca
programVersion: 5.0.2
elementType: Cl Cl O O O N C C C C C C C C C C C C C C C C C C C C C C H H H H H H H H H H H H H H H H H H H
charge: 0
multiplicity: 1
keywords: wb97x-d3
keywords: def2-TZVPP
keywords: def2/J RIJCOSX
keywords: DEFGRID2
keywords: scfconv7
keywords: smallprint printgap noloewdin
keywords: NOSOSCF
formula: C22H19Cl2NO3
InChI: InChI=1/C22H19Cl2NO3/c1-22(2)17(12-19(23)24)20(22)21(26)28-18(13-25)14-7-6-10-16(11-14)27-15-8-4-3-5-9-15/h3-12,17-18,20H,1-2H3
47 atoms
Cl -3.187709 1.45378 -1.808518
Cl -4.97854 0.805218 0.365285
O  1.796657 1.24573 0.561562
O  1.97396 2.535248 2.385229
O  1.179721 -3.680686 0.357945
N  4.669078 2.378822 -0.725904
C  -0.607002 3.11791 -0.036613
C  -1.010893 1.716735 0.308117
C  -0.099108 2.469027 1.242244
C  0.305587 3.343824 -1.216428
C  -1.606887 4.23162 0.162049
C  -2.386475 1.38372 0.73992
C  1.317121 2.113937 1.477069
C  -3.389813 1.245596 -0.114813
C  3.135421 0.804986 0.692222
C  3.218127 -0.639752 0.244231
C  3.996432 1.686546 -0.103692
C  2.135952 -1.473558 0.496941
C  4.368917 -1.145727 -0.341388
C  2.201705 -2.812803 0.139144
C  4.428972 -2.492684 -0.671477
C  3.352846 -3.32983 -0.442724
C  -0.093703 -3.192983 0.490717
C  -0.775766 -3.440406 1.669895
C  -0.700563 -2.498799 -0.549125
C  -2.081811 -2.989264 1.807863
C  -1.999616 -2.04341 -0.394564
C  -2.694652 -2.285703 0.783224
H  -0.538556 0.941761 -0.289455
H  -0.548268 2.866881 2.145981
H  0.934806 4.221709 -1.061222
H  -0.296768 3.523196 -2.108159
H  0.955874 2.498832 -1.428918
H  -2.26543 4.310614 -0.704189
H  -1.092286 5.186144 0.279743
H  -2.234848 4.081558 1.03957
H  -2.591034 1.216654 1.790471
H  3.457441 0.88769 1.736219
H  1.240719 -1.084489 0.961916
H  5.21399 -0.503546 -0.551846
H  5.324483 -2.889966 -1.12994
H  3.392321 -4.376504 -0.713444
H  -0.287462 -3.984866 2.467406
H  -0.161169 -2.319598 -1.470719
H  -2.61782 -3.185594 2.72705
H  -2.47326 -1.500813 -1.202265
H  -3.708684 -1.927228 0.896974
totalener: -2050.65730426 hartree
nucrepener: 2913.27638263 hartree
electener: -4963.93368689 hartree
oneelecener: -8601.28311804 hartree
twoeener: 3637.34943115 hartree
kineticenergy: 2044.52851070 hartree
xcener: -151.873149834319 hartree
chargesum: 0.0000000
charge: -0.041022 -0.040174 -0.277424 -0.337556 -0.296179 0.001197 0.106289 -0.041736 -0.094152 -0.253664 -0.253492 -0.172558 0.332697 0.043401 0.302565 0.009475 -0.260250 -0.166020 -0.185435 0.231476 -0.076854 -0.206317 0.232912 -0.177991 -0.168603 -0.116643 -0.136394 -0.130491 0.105618 0.090337 0.106232 0.088668 0.087696 0.092409 0.103671 0.084095 0.120046 0.130726 0.118846 0.123735 0.128766 0.128191 0.127352 0.135436 0.128802 0.138803 0.133516
qa: -0.0410 -0.0402 -0.2774 -0.3376 -0.2962 0.0012 0.1063 -0.0417 -0.0942 -0.2537 -0.2535 -0.1726 0.3327 0.0434 0.3026 0.0095 -0.2603 -0.1660 -0.1854 0.2315 -0.0769 -0.2063 0.2329 -0.1780 -0.1686 -0.1166 -0.1364 -0.1305 0.1056 0.0903 0.1062 0.0887 0.0877 0.0924 0.1037 0.0841 0.1200 0.1307 0.1188 0.1237 0.1288 0.1282 0.1274 0.1354 0.1288 0.1388 0.1335
va: 1.2863 1.2662 2.0851 2.1698 2.1164 3.1094 3.7339 3.7746 3.8957 3.9046 3.9124 3.8070 4.2557 4.1688 3.8122 3.8296 4.0087 3.9011 4.0187 3.8651 3.9620 4.0448 3.7980 4.0279 3.9546 3.9695 3.8596 3.8932 1.0162 1.0288 1.0024 1.0071 1.0188 1.0073 1.0052 1.0018 1.0178 1.0197 1.0280 1.0199 0.9994 1.0127 1.0112 1.0040 0.9990 1.0077 1.0112
dispcorr: -0.029729385 hartree
energy: -2050.687033640827
dipole: 13.05621 -14.13655 -1.08034 2.69396 -3.42246 -0.72849 2.54471 -2.31641 0.22830
magnitude: 1.32286 au
magnitude: 3.36244 debye
