program: Orca
programVersion: 5.0.2
elementType: Cl Cl O O O N C C C C C C C C C C C C C C C C C C C C C C H H H H H H H H H H H H H H H H H H H
charge: 0
multiplicity: 1
keywords: wb97x-d3
keywords: def2-TZVPP
keywords: def2/J RIJCOSX
keywords: DEFGRID2
keywords: scfconv7
keywords: smallprint printgap noloewdin
keywords: NOSOSCF
formula: C22H19Cl2NO3
InChI: InChI=1/C22H19Cl2NO3/c1-22(2)17(12-19(23)24)20(22)21(26)28-18(13-25)14-7-6-10-16(11-14)27-15-8-4-3-5-9-15/h3-12,17-18,20H,1-2H3
47 atoms
Cl -1.56617 0.023644 1.781531
Cl -4.396363 0.466438 1.570154
O  1.920933 1.548867 0.745928
O  1.48686 1.37306 -1.438355
O  0.853033 -3.378898 0.338805
N  4.748762 2.424724 -0.916995
C  -0.861454 3.334509 -0.858089
C  -1.373627 1.934893 -0.755682
C  -0.147952 2.329656 0.031605
C  -0.259789 3.80512 -2.159341
C  -1.595406 4.423926 -0.111595
C  -2.657973 1.611459 -0.100574
C  1.138639 1.713625 -0.344426
C  -2.833091 0.811164 0.941752
C  3.176366 0.930437 0.545155
C  3.094132 -0.507811 0.068182
C  4.035709 1.760887 -0.308968
C  1.99668 -1.277743 0.42231
C  4.136777 -1.078059 -0.650247
C  1.925986 -2.602942 0.015728
C  4.071902 -2.413642 -1.013659
C  2.963897 -3.18192 -0.696408
C  -0.403422 -2.952136 0.014308
C  -1.444716 -3.423164 0.801814
C  -0.660306 -2.122143 -1.07105
C  -2.747126 -3.056061 0.505471
C  -1.970138 -1.766187 -1.353709
C  -3.018346 -2.223892 -0.570292
H  -1.158993 1.312241 -1.621754
H  -0.277022 2.488314 1.094955
H  0.485923 4.581931 -1.984035
H  -1.043896 4.237372 -2.78368
H  0.21587 3.00873 -2.724651
H  -2.414413 4.81828 -0.716078
H  -0.922059 5.252527 0.111549
H  -2.018245 4.074543 0.830545
H  -3.552337 2.033179 -0.545643
H  3.631563 0.940513 1.54028
H  1.179167 -0.85683 0.993553
H  4.9947 -0.486828 -0.942427
H  4.885392 -2.8542 -1.573938
H  2.895089 -4.217867 -1.00009
H  -1.227577 -4.069292 1.642152
H  0.144984 -1.753868 -1.693558
H  -3.554826 -3.417261 1.127967
H  -2.168943 -1.126101 -2.20356
H  -4.035427 -1.932461 -0.793387
totalener: -2050.65458359 hartree
nucrepener: 3016.77252430 hartree
electener: -5067.42710789 hartree
oneelecener: -8809.19614648 hartree
twoeener: 3741.76903859 hartree
kineticenergy: 2044.55752357 hartree
xcener: -151.884397805603 hartree
chargesum: 0.0000000
charge: -0.036284 -0.051692 -0.279084 -0.356257 -0.300028 0.000206 0.096052 -0.017528 -0.079937 -0.245194 -0.263764 -0.293581 0.315142 0.174391 0.416840 0.009299 -0.280723 -0.225700 -0.170491 0.221951 -0.087169 -0.190613 0.239082 -0.198372 -0.143381 -0.081198 -0.139216 -0.173569 0.087466 0.106146 0.092705 0.084666 0.104013 0.092086 0.098811 0.088385 0.112698 0.124924 0.131896 0.120020 0.129611 0.128225 0.122504 0.136018 0.123249 0.129897 0.127495
qa: -0.0363 -0.0517 -0.2791 -0.3563 -0.3000 0.0002 0.0961 -0.0175 -0.0799 -0.2452 -0.2638 -0.2936 0.3151 0.1744 0.4168 0.0093 -0.2807 -0.2257 -0.1705 0.2220 -0.0872 -0.1906 0.2391 -0.1984 -0.1434 -0.0812 -0.1392 -0.1736 0.0875 0.1061 0.0927 0.0847 0.1040 0.0921 0.0988 0.0884 0.1127 0.1249 0.1319 0.1200 0.1296 0.1282 0.1225 0.1360 0.1232 0.1299 0.1275
va: 1.3089 1.2544 2.1164 2.1317 2.1110 3.1112 3.8109 3.8140 3.8539 3.9010 3.9127 3.9402 4.1834 4.1423 3.9081 3.7550 4.0539 4.0189 4.0070 3.8474 3.9506 4.0553 3.7995 3.9959 3.8524 3.9315 3.8919 3.8844 1.0326 1.0303 1.0030 1.0011 1.0225 1.0031 1.0057 1.0003 1.0242 0.9846 1.0187 1.0235 1.0001 1.0103 1.0147 1.0109 1.0009 0.9985 1.0060
dispcorr: -0.032006246 hartree
energy: -2050.686589839550
dipole: 4.46056 -5.54254 -1.08199 10.31990 -10.32554 -0.00564 -15.38953 15.80028 0.41075
magnitude: 1.15734 au
magnitude: 2.94173 debye
