program: Orca
programVersion: 5.0.2
elementType: Cl Cl O O O N C C C C C C C C C C C C C C C C C C C C C C H H H H H H H H H H H H H H H H H H H
charge: 0
multiplicity: 1
keywords: wb97x-d3
keywords: def2-TZVPP
keywords: def2/J RIJCOSX
keywords: DEFGRID2
keywords: scfconv7
keywords: smallprint printgap noloewdin
keywords: NOSOSCF
formula: C22H19Cl2NO3
InChI: InChI=1/C22H19Cl2NO3/c1-22(2)17(12-19(23)24)20(22)21(26)28-18(13-25)14-7-6-10-16(11-14)27-15-8-4-3-5-9-15/h3-12,17-18,20H,1-2H3
47 atoms
Cl -0.396733 4.382384 -2.632594
Cl -2.765469 6.021954 -2.457473
O  0.702958 0.78812 -0.970982
O  1.673607 2.19722 0.475463
O  0.516522 -4.376357 0.250377
N  2.030577 -0.771314 -3.572117
C  -1.283796 2.778329 1.314998
C  -0.812614 3.844573 0.383818
C  -0.659562 2.397653 -0.019329
C  -0.541059 2.558485 2.60973
C  -2.766117 2.51077 1.423836
C  -1.760143 4.711224 -0.351355
C  0.695099 1.821727 -0.112276
C  -1.654215 4.997938 -1.64217
C  1.920533 0.05831 -1.097655
C  1.95441 -1.083015 -0.111474
C  1.968791 -0.405373 -2.485399
C  1.220622 -2.235117 -0.354031
C  2.668542 -0.942609 1.071534
C  1.212909 -3.25871 0.5826
C  2.650621 -1.970498 2.000681
C  1.93064 -3.130801 1.766877
C  0.041244 -5.201237 1.232837
C  0.409084 -6.536326 1.198804
C  -0.830885 -4.730159 2.205335
C  -0.105451 -7.40996 2.145624
C  -1.331071 -5.611187 3.150781
C  -0.971906 -6.951512 3.125409
H  0.119094 4.327289 0.669302
H  -1.356068 2.026134 -0.761632
H  -0.980151 3.181063 3.391375
H  0.514939 2.806138 2.541962
H  -0.622802 1.51889 2.932146
H  -2.944466 1.485054 1.749301
H  -3.28911 2.651921 0.477749
H  -3.224232 3.174097 2.160205
H  -2.57964 5.162223 0.196056
H  2.779885 0.715597 -0.934535
H  0.662733 -2.360199 -1.274309
H  3.226871 -0.037355 1.267544
H  3.211769 -1.873291 2.92026
H  1.938751 -3.929875 2.496376
H  1.085619 -6.884299 0.429763
H  -1.120244 -3.687045 2.218238
H  0.178545 -8.453358 2.11672
H  -2.012404 -5.247528 3.908096
H  -1.369325 -7.634674 3.863759
totalener: -2050.65986089 hartree
nucrepener: 2709.49732442 hartree
electener: -4760.15718531 hartree
oneelecener: -8194.39297608 hartree
twoeener: 3434.23579077 hartree
kineticenergy: 2044.54288266 hartree
xcener: -151.871557127484 hartree
chargesum: -0.0000000
charge: -0.026895 -0.039193 -0.253986 -0.388508 -0.291566 -0.002157 0.111425 -0.015545 -0.163877 -0.254033 -0.268109 -0.246691 0.386720 0.091975 0.324880 -0.003486 -0.262801 -0.184553 -0.136417 0.192566 -0.122590 -0.144728 0.209400 -0.182338 -0.149660 -0.104397 -0.119009 -0.129871 0.109985 0.107774 0.087277 0.103618 0.089147 0.095662 0.089177 0.093471 0.118610 0.122479 0.122105 0.125119 0.130397 0.133960 0.128793 0.132152 0.128091 0.127697 0.127932
qa: -0.0269 -0.0392 -0.2540 -0.3885 -0.2916 -0.0022 0.1114 -0.0155 -0.1639 -0.2540 -0.2681 -0.2467 0.3867 0.0920 0.3249 -0.0035 -0.2628 -0.1846 -0.1364 0.1926 -0.1226 -0.1447 0.2094 -0.1823 -0.1497 -0.1044 -0.1190 -0.1299 0.1100 0.1078 0.0873 0.1036 0.0891 0.0957 0.0892 0.0935 0.1186 0.1225 0.1221 0.1251 0.1304 0.1340 0.1288 0.1322 0.1281 0.1277 0.1279
va: 1.3063 1.2667 2.1272 2.1112 2.1112 3.1162 3.7294 3.8433 3.8933 3.9012 3.9153 3.9067 4.1580 4.2074 3.8131 3.7297 4.0318 4.0972 3.9637 3.9135 3.9751 3.9268 3.8313 4.0296 3.9640 3.9371 3.9443 3.9497 1.0245 1.0248 1.0029 1.0209 1.0018 1.0060 1.0009 1.0013 1.0172 1.0206 1.0295 1.0205 1.0010 1.0050 1.0118 1.0032 0.9990 0.9998 0.9997
dispcorr: -0.023881434 hartree
energy: -2050.683742321024
dipole: -1.28165 0.52103 -0.76062 -27.58905 27.29430 -0.29475 34.83008 -32.41709 2.41299
magnitude: 2.54714 au
magnitude: 6.47432 debye
