program: Orca
programVersion: 5.0.2
elementType: Cl Cl O O O N C C C C C C C C C C C C C C C C C C C C C C H H H H H H H H H H H H H H H H H H H
charge: 0
multiplicity: 1
keywords: wb97x-d3
keywords: def2-TZVPP
keywords: def2/J RIJCOSX
keywords: DEFGRID2
keywords: scfconv7
keywords: smallprint printgap noloewdin
keywords: NOSOSCF
formula: C22H19Cl2NO3
InChI: InChI=1/C22H19Cl2NO3/c1-22(2)17(12-19(23)24)20(22)21(26)28-18(13-25)14-7-6-10-16(11-14)27-15-8-4-3-5-9-15/h3-12,17-18,20H,1-2H3
47 atoms
Cl -1.677021 3.408295 -2.65356
Cl -3.767044 5.168774 -1.723459
O  0.587232 0.405528 -0.931871
O  1.950662 2.140623 -0.554524
O  1.548663 -3.710733 2.251651
N  0.800886 -2.084897 -3.111779
C  -0.311994 2.973237 1.43629
C  -0.442822 3.761655 0.175888
C  -0.350003 2.259186 0.092566
C  0.968436 3.067931 2.228974
C  -1.535959 2.771188 2.297547
C  -1.70741 4.441804 -0.180314
C  0.859322 1.64417 -0.484482
C  -2.301826 4.348685 -1.362213
C  1.700721 -0.374709 -1.353926
C  2.327538 -1.076921 -0.175093
C  1.180416 -1.326354 -2.337588
C  1.622116 -2.093495 0.460045
C  3.563193 -0.669233 0.299185
C  2.173665 -2.718835 1.56762
C  4.100724 -1.297694 1.415044
C  3.418224 -2.319305 2.047845
C  0.497663 -4.367768 1.664844
C  -0.757228 -4.253049 2.239494
C  0.696615 -5.155389 0.539394
C  -1.825523 -4.941225 1.681594
C  -0.379835 -5.828742 -0.014984
C  -1.642177 -5.724507 0.55252
H  0.458027 4.283932 -0.137891
H  -1.268814 1.723414 -0.114774
H  1.836439 3.283031 1.611748
H  1.161247 2.13874 2.767632
H  0.879944 3.865604 2.968553
H  -1.651548 3.597244 3.001868
H  -1.443823 1.853328 2.87939
H  -2.453815 2.701546 1.713393
H  -2.173267 5.079216 0.562323
H  2.4444 0.252375 -1.85468
H  0.653001 -2.396294 0.082671
H  4.097138 0.135554 -0.187607
H  5.065788 -0.989051 1.793759
H  3.837405 -2.81554 2.913273
H  -0.889924 -3.634302 3.11726
H  1.681935 -5.237132 0.098505
H  -2.806628 -4.856432 2.129535
H  -0.229098 -6.437586 -0.896212
H  -2.478354 -6.253117 0.115457
totalener: -2050.65990455 hartree
nucrepener: 2771.01245089 hartree
electener: -4821.67235543 hartree
oneelecener: -8317.64519271 hartree
twoeener: 3495.97283728 hartree
kineticenergy: 2044.54935540 hartree
xcener: -151.873162369456 hartree
chargesum: 0.0000000
charge: -0.027549 -0.040136 -0.259287 -0.383005 -0.295884 -0.003884 0.112588 -0.007061 -0.167238 -0.252047 -0.268516 -0.252342 0.378782 0.093798 0.333354 -0.006774 -0.267567 -0.177734 -0.147993 0.229819 -0.083064 -0.206270 0.218059 -0.178021 -0.156164 -0.110649 -0.107895 -0.124493 0.107961 0.109367 0.102361 0.091477 0.086531 0.092834 0.096691 0.088742 0.119093 0.121964 0.125453 0.118226 0.127351 0.127872 0.124344 0.133237 0.126417 0.129619 0.127636
qa: -0.0275 -0.0401 -0.2593 -0.3830 -0.2959 -0.0039 0.1126 -0.0071 -0.1672 -0.2520 -0.2685 -0.2523 0.3788 0.0938 0.3334 -0.0068 -0.2676 -0.1777 -0.1480 0.2298 -0.0831 -0.2063 0.2181 -0.1780 -0.1562 -0.1106 -0.1079 -0.1245 0.1080 0.1094 0.1024 0.0915 0.0865 0.0928 0.0967 0.0887 0.1191 0.1220 0.1255 0.1182 0.1274 0.1279 0.1243 0.1332 0.1264 0.1296 0.1276
va: 1.3045 1.2652 2.1310 2.1191 2.1169 3.1181 3.7304 3.8357 3.8936 3.9017 3.9145 3.9064 4.1732 4.2061 3.8246 3.7039 4.0352 3.9659 3.9868 3.8505 3.9492 4.0342 3.8252 4.0299 3.9846 3.9399 3.9505 3.9503 1.0256 1.0242 1.0209 1.0013 1.0031 1.0018 1.0060 1.0003 1.0177 1.0206 1.0213 1.0198 0.9994 1.0125 1.0116 1.0035 0.9995 0.9999 1.0000
dispcorr: -0.024660049 hartree
energy: -2050.684564594600
dipole: 12.48181 -12.47490 0.00691 -16.83355 17.24494 0.41139 27.40875 -25.77425 1.63450
magnitude: 1.68549 au
magnitude: 4.28418 debye
