program: Gaussian 09
title: 000074478
version: EM64L-G09RevD.01
frameworkgroup: C1[X(C7H6ClNO3)]
method: RPBEPBE
basis: SDD
operation: Freq
keyword: #p
keyword: freq=noraman
keyword: PBEPBE/SDD
title: #p freq=noraman PBEPBE/SDD
converged: NO NO NO NO
title: Mulliken charges:
elementType: Cl O O O N C C C C C C C H H H H H H
charge: -0.034814 -0.375712 -0.179028 -0.268377 0.027231 0.426715 -0.001000 0.309971 -0.385512 -0.357274 -0.075952 -0.765715 0.271007 0.310466 0.251458 0.220373 0.251086 0.375078
chargesum: 0.00000
title: Mulliken charges with hydrogens summed into heavy atoms:
elementType: Cl O O O N C C C C C C C
charge: -0.034814 -0.000634 -0.179028 -0.268377 0.027231 0.426715 -0.001000 0.309971 -0.114506 -0.046809 -0.075952 -0.042798
polarizability: 1.50136151e+02 -1.06833813e+00 1.37446207e+02 2.85904840e-03 1.08570999e-03 4.38311665e+01
1716.lowfreq: -5.7409 0.0004 0.0006 0.0008 6.3729 13.0224 75.1937 102.6067 126.8881
frequency: 75.1857 102.6058 126.8839 139.9108 176.5023 214.9169 240.8569 340.2466 344.8661 349.2925 383.3281 425.3472 463.0549 501.2470 552.2281 599.7972 675.7128 679.0299 721.2026 750.7759 853.7119 854.4001 888.0477 900.9638 914.9971 1007.9345 1049.5532 1093.8357 1139.1272 1168.1885 1231.5051 1264.1490 1309.5733 1366.8213 1395.0199 1405.8292 1427.5291 1453.9777 1474.2918 1488.8881 1591.5109 1603.7245 2962.1139 2992.7558 3071.3215 3106.7871 3164.3509 3194.9220
redmass: 9.3414 1.0596 6.0824 8.7048 15.4642 3.3820 3.5376 6.9737 4.8249 17.0150 9.1316 9.3072 4.4607 5.1734 3.5896 4.7956 7.4197 10.6747 6.4902 7.7858 6.3755 1.1113 1.4190 1.3317 5.6739 1.5724 1.5183 1.5866 10.5516 2.4934 2.6185 2.8542 2.4347 5.4120 2.8093 1.3242 3.1203 1.0436 1.2117 3.7381 5.0902 6.4445 1.0658 1.0371 1.0967 1.1006 1.0929 1.0931
irintensity: 0.0000 0.2651 0.0196 1.3129 2.0270 3.3975 0.4239 0.2920 14.0789 3.0528 3.5491 0.8125 4.9108 4.3648 9.3850 12.1786 0.0326 27.4381 11.7535 17.8895 36.1600 137.5910 24.5644 4.1860 0.1636 12.8469 8.2108 13.1524 126.7935 201.8369 74.8907 133.5174 166.6680 74.0900 61.9660 63.3858 32.6742 14.9209 24.1161 91.5223 6.8476 11.8757 162.2716 12.4833 9.8801 14.1442 1.3787 11.5277
temp: 298.150 k
press: 1.00000 atm
elementType: 17 8 8 8 7 6 6 6 6 6 6 6 1 1 1 1 1 1
symmnumber: 1
zpe: 318438.9 jmol-1
zpe.correction: 0.121287 hartree
zpe.thermalcorrener: 0.132106 hartree
zpe.thermalcorrenthalpy: 0.133051 hartree
zpe.thermalcorrgfe: 0.084185 hartree
zpe.sumelectzpe: -1009.880944 hartree
zpe.sumelectthermal: -1009.870124 hartree
zpe.sumelectthermalent: -1009.869180 hartree
zpe.sumelectthermalfe: -1009.918046 hartree
dipole: -1.9916 3.1566 0.0105
dipole: 3.7324
quadrupole: -85.3754 -76.4617 -76.2462
quadrupole: 1.4515 0.0070 0.0271
quadrupole: -6.0143 2.8994 3.1149 1.4515 0.0070 0.0271
hfenergy: -1010.0022309 hartree
pointgroup: C01 [X(C7H6Cl1N1O3)]
dipole: -1.2344965 -0.7950394 -0.0150157 debye
dipolederiv: -0.4396473 0.3127563 -0.0107119 0.4038654 -0.4597922 0.0122576 -0.011967 0.0108831 -0.0539269 -0.663324 0.4910546 -0.0135262 0.2703647 -0.8853214 0.0124611 -0.0100819 0.0172723 -0.3516471 -0.5951672 -0.2151468 -0.0034958 -0.4150049 -0.8247993 0.0016192 -0.000677 0.0044171 -0.2094592 -0.831639 0.1452892 -0.0111772 0.3636676 -0.5999242 0.0103471 -0.0149527 0.0065908 -0.2732547 1.8593267 0.3277553 0.0229446 0.2737025 1.1487739 -0.0081596 0.0237026 -0.0066487 0.2077305 -0.1005482 0.4933262 -0.0080331 0.175692 0.3182707 -0.0005394 -0.0025197 0.0059698 -0.0340516 0.5891597 -0.7466847 0.0203535 -0.0783181 0.592407 -0.0093074 0.0110344 -0.0215024 0.0847545 -0.9196439 -0.3944415 -0.0108815 -0.1629448 -0.1173604 -0.0004438 -0.0140314 -0.004315 0.0300286 0.0204827 0.1257179 0.0009068 0.2602633 0.0288334 0.0023351 -0.0010579 -0.0001638 -0.086179 0.1357981 0.3223458 -0.0005525 -0.1481415 -0.3021534 0.000083 0.0060522 0.0088301 -0.0733789 0.3482887 -0.7757551 0.0173093 -0.8316195 0.5455627 -0.0220735 0.0176212 -0.0213614 -0.0676145 0.090086 0.0351145 -0.0002363 -0.0454817 -0.2019121 0.0021421 -0.0003892 0.0015605 0.0424353 -0.0141385 -0.0352161 -0.0026955 -0.032166 0.1053791 0.0000818 -0.002558 0.0001154 0.1536911 0.1219931 -0.0422647 -0.0004903 0.0194412 0.0960591 0.0015871 -0.00128 0.0001707 0.1830876 0.080359 0.0057759 -0.0756589 -0.0106794 0.0292952 0.0590071 -0.0354543 0.0910937 -0.0180128 -0.1363541 -0.0691943 -0.0017213 0.04151 0.0754523 0.0008471 -0.0033388 -0.0000599 0.1123523 0.0775769 0.0087474 0.0775214 -0.0091423 0.0250679 -0.060477 0.0382336 -0.0917509 -0.0136986 0.3773914 0.0108203 0.0001449 -0.0750086 0.4261616 -0.0017676 0.0016639 -0.0011014 0.3671435 unknown
polarizability: 148.6587056|-4.1453943|138.8728475|1.883446|-1.343195|43.8819719 unknown
InChI: InChI=1S/C7H6ClNO3/c1-4-2-5(8)3-6(7(4)10)9(11)12/h2-3,10H,1H3
charge 0 multiplicity 1
18 atoms
Cl -2.802213 2.495378 -0.05836
O  1.057078 -2.111456 0.073896
O  2.5035 1.840318 0.041102
O  2.937775 -0.396613 0.078997
N  2.096083 0.624613 0.05046
C  -1.193895 -1.292026 0.019615
C  0.213128 -1.029389 0.042694
C  0.669665 0.330089 0.031796
C  -2.081745 -0.20192 -0.010597
C  -0.236387 1.423366 -0.000495
C  -1.598076 1.13301 -0.019811
C  -1.67269 -2.725728 0.028032
H  -3.160337 -0.385596 -0.028425
H  0.152792 2.44349 -0.008348
H  -1.298701 -3.26037 0.919734
H  -2.773254 -2.779532 0.017192
H  -1.28131 -3.276694 -0.846302
H  2.015486 -1.74804 0.08182
