program: Orca
programVersion: 5.0.2
elementType: Cl Cl O O O N C C C C C C C C C C C C C C C C C C C C C C H H H H H H H H H H H H H H H H H H H
charge: 0
multiplicity: 1
keywords: wb97x-d3
keywords: def2-TZVPP
keywords: def2/J RIJCOSX
keywords: DEFGRID2
keywords: scfconv7
keywords: smallprint printgap noloewdin
keywords: NOSOSCF
formula: C22H19Cl2NO3
InChI: InChI=1/C22H19Cl2NO3/c1-22(2)17(12-19(23)24)20(22)21(26)28-18(13-25)14-7-6-10-16(11-14)27-15-8-4-3-5-9-15/h3-12,17-18,20H,1-2H3
47 atoms
Cl 0.251305 5.139286 0.681794
Cl -1.550624 7.113549 -0.40647
O  1.355663 1.227654 -0.574411
O  -0.199293 0.914286 1.004156
O  0.734741 -4.116204 1.407027
N  4.633705 0.868816 -0.679766
C  -2.0566 2.022225 -1.3019
C  -1.836895 3.049314 -0.240476
C  -0.643804 2.361265 -0.852316
C  -2.689515 0.704677 -0.926979
C  -2.411839 2.482649 -2.69528
C  -2.067662 4.489381 -0.491094
C  0.14683 1.432244 -0.021791
C  -1.230269 5.450361 -0.124081
C  2.201558 0.290748 0.080596
C  1.842188 -1.128795 -0.284315
C  3.560336 0.623965 -0.352876
C  1.422699 -2.002729 0.702118
C  1.90527 -1.542408 -1.611071
C  1.084674 -3.310857 0.371638
C  1.553955 -2.840845 -1.929825
C  1.145281 -3.734676 -0.948949
C  0.037519 -5.269621 1.169539
C  -1.250207 -5.228089 0.652545
C  0.627088 -6.47644 1.508904
C  -1.94813 -6.411916 0.476819
C  -0.084583 -7.654427 1.335322
C  -1.369488 -7.627422 0.816184
H  -2.064905 2.72404 0.771862
H  -0.061086 2.930926 -1.567041
H  -3.77333 0.776295 -1.032812
H  -2.475434 0.405109 0.09613
H  -2.346013 -0.091895 -1.58926
H  -2.107525 1.738425 -3.432397
H  -1.932016 3.425185 -2.960284
H  -3.490654 2.619424 -2.792112
H  -2.989608 4.788324 -0.976121
H  2.153776 0.419559 1.166502
H  1.349112 -1.680744 1.7331
H  2.234553 -0.861556 -2.385423
H  1.606692 -3.175116 -2.957328
H  0.888017 -4.75022 -1.218589
H  -1.703951 -4.278015 0.400254
H  1.630812 -6.486793 1.912561
H  -2.954318 -6.382794 0.080787
H  0.372761 -8.597235 1.604562
H  -1.920745 -8.547868 0.682115
totalener: -2050.65974190 hartree
nucrepener: 2710.64273564 hartree
electener: -4761.30247754 hartree
oneelecener: -8196.69889230 hartree
twoeener: 3435.39641476 hartree
kineticenergy: 2044.54424594 hartree
xcener: -151.871293828502 hartree
chargesum: -0.0000000
charge: -0.029055 -0.039645 -0.255650 -0.375274 -0.292653 -0.001749 0.110887 -0.011909 -0.160351 -0.249280 -0.270121 -0.248511 0.370655 0.092254 0.314649 0.014480 -0.255969 -0.148213 -0.185217 0.212137 -0.123526 -0.147432 0.201997 -0.150114 -0.172744 -0.120296 -0.110099 -0.125036 0.109147 0.106673 0.087213 0.100981 0.089986 0.095835 0.089507 0.093458 0.118768 0.118268 0.111935 0.123821 0.130175 0.132126 0.134958 0.127682 0.128391 0.128590 0.128273
qa: -0.0291 -0.0396 -0.2556 -0.3753 -0.2927 -0.0017 0.1109 -0.0119 -0.1604 -0.2493 -0.2701 -0.2485 0.3707 0.0923 0.3146 0.0145 -0.2560 -0.1482 -0.1852 0.2121 -0.1235 -0.1474 0.2020 -0.1501 -0.1727 -0.1203 -0.1101 -0.1250 0.1091 0.1067 0.0872 0.1010 0.0900 0.0958 0.0895 0.0935 0.1188 0.1183 0.1119 0.1238 0.1302 0.1321 0.1350 0.1277 0.1284 0.1286 0.1283
va: 1.3031 1.2663 2.1309 2.1312 2.1100 3.1200 3.7396 3.8364 3.8831 3.9021 3.9139 3.9084 4.1795 4.2062 3.8442 3.6614 4.0232 4.0501 4.0299 3.9108 3.9733 3.9266 3.8398 3.9745 4.0262 3.9422 3.9383 3.9457 1.0264 1.0246 1.0029 1.0198 1.0016 1.0063 1.0008 1.0013 1.0170 1.0193 1.0306 1.0172 1.0010 1.0070 1.0027 1.0113 0.9998 0.9990 0.9997
dispcorr: -0.024089907 hartree
energy: -2050.683831807335
dipole: -14.94049 12.97432 -1.96617 -40.88103 39.64928 -1.23175 -10.61613 9.92555 -0.69058
magnitude: 2.42073 au
magnitude: 6.15301 debye
