program: Gaussian 09
title: 000074476
version: EM64L-G09RevD.01
frameworkgroup: C1[X(C6H3F7O)]
method: RPBEPBE
basis: SDD
operation: Freq
keyword: #pfreq=noraman
keyword: PBEPBE/SDD
title: #p freq=noraman PBEPBE/SDD
converged: YES YES NO NO
title: Mulliken charges:
elementType: F F F F F F F O C C C C C C H H H
charge: -0.134279 -0.129864 -0.150604 -0.155531 -0.151065 -0.146663 -0.126814 -0.214837 0.206787 0.170958 0.185125 0.208097 0.172950 -0.504580 0.256775 0.257177 0.256366
chargesum: 0.00000
title: Mulliken charges with hydrogens summed into heavy atoms:
elementType: F F F F F F F O C C C C C C
charge: -0.134279 -0.129864 -0.150604 -0.155531 -0.151065 -0.146663 -0.126814 -0.214837 0.206787 0.170958 0.185125 0.208097 0.172950 0.265739
polarizability: 9.54453652e+01 3.96942325e+00 6.93986417e+01 8.43658511e-01 -9.27962386e-01 5.42540216e+01
1716.lowfreq: 0.0009 0.0009 0.0010 3.9216 8.5142 11.4060 28.6231 64.0709 85.4220
frequency: 28.5938 64.0643 85.4033 153.1188 173.2641 178.5930 212.5546 222.1459 245.9595 247.8442 286.5366 288.2038 306.1578 329.6730 384.8418 389.3821 439.3573 455.8693 530.6531 555.7549 567.5340 589.8212 651.1909 796.0479 853.4658 905.4623 954.1482 959.8800 981.5181 1041.5250 1051.3181 1082.9528 1113.0687 1150.1971 1168.8171 1189.7042 1318.9220 1337.2273 1445.6894 1464.6851 1468.9018 1685.0611 3013.3262 3125.0598 3161.8735
redmass: 18.1563 3.0571 4.8040 2.0807 4.8033 2.5164 14.9931 17.4291 16.2007 16.8995 16.7253 15.6663 16.8308 6.1721 15.6166 14.4169 8.5135 14.2038 14.7328 15.0290 16.7742 15.9422 12.7512 10.4305 11.0479 11.2609 12.3859 12.9278 13.0253 12.7779 13.0507 10.0544 1.2382 1.8616 5.2841 5.9044 8.3604 8.8529 1.2108 1.0510 1.0548 11.3033 1.0294 1.1066 1.1051
irintensity: 0.0600 4.9893 1.2074 0.7154 3.9153 5.6999 2.5829 0.2249 0.7074 0.2216 3.8564 1.7660 0.5174 15.6954 2.5178 5.5088 2.0543 0.7655 13.8958 6.3774 6.1141 3.6906 2.2130 4.1379 55.4237 221.0716 226.2339 1.8921 296.3126 23.5982 99.8398 135.4683 0.4123 34.4861 85.6830 42.4491 368.8976 19.4932 23.6210 25.1308 22.9683 138.4927 30.1312 14.3200 8.1922
temp: 298.150 k
press: 1.00000 atm
elementType: 9 9 9 9 9 9 9 8 6 6 6 6 6 6 1 1 1
symmnumber: 1
zpe: 231210.4 jmol-1
zpe.correction: 0.088063 hartree
zpe.thermalcorrener: 0.101476 hartree
zpe.thermalcorrenthalpy: 0.102420 hartree
zpe.thermalcorrgfe: 0.047537 hartree
zpe.sumelectzpe: -1003.428956 hartree
zpe.sumelectthermal: -1003.415544 hartree
zpe.sumelectthermalent: -1003.414600 hartree
zpe.sumelectthermalfe: -1003.469482 hartree
dipole: -4.8786 0.2519 -0.1485
dipole: 4.8874
quadrupole: -68.2653 -85.0925 -79.8722
quadrupole: -1.0798 0.0018 0.0966
quadrupole: 9.4780 -7.3492 -2.1289 -1.0798 0.0018 0.0966
hfenergy: -1003.5170194 hartree
pointgroup: C01 [X(C6H3F7O1)]
dipole: -1.9173484 -0.0957764 0.109105 debye
dipolederiv: -0.2982464 0.0972868 0.0861032 0.1274439 -0.3734818 -0.1892903 0.1110584 -0.1773512 -0.5987461 -0.4209748 0.195611 -0.1717814 0.2391422 -0.4369692 0.1859153 -0.1703988 0.1534469 -0.4389904 -0.2968466 -0.082151 0.1107074 -0.0942652 -0.4782333 0.1785458 0.1062117 0.2323977 -0.6386137 -0.4071837 -0.198693 -0.1453877 -0.1870064 -0.5814755 -0.1739455 -0.1214439 -0.1656183 -0.4274826 -0.7379238 -0.1121059 -0.1878725 -0.1077553 -0.2601382 -0.1034382 -0.3300487 -0.0961202 -0.5569446 -0.7039939 -0.1166039 0.2528975 -0.1234569 -0.2631129 0.1024024 0.2757285 0.0869404 -0.5486586 -0.1672813 0.0518317 0.0013267 -0.2052702 -0.9850465 0.1109754 0.0182986 0.079049 -0.054483 -1.7503222 -0.2451745 0.1242647 0.2267684 -0.2361936 -0.0125527 0.1355842 0.0355387 -0.2492285 0.7210618 -0.4023616 0.0961876 -0.5016436 0.8264962 -0.0021132 0.0636499 0.0218043 1.0090047 0.4940129 0.3103722 0.0670455 0.4129735 1.2538736 -0.0206844 0.0296546 -0.0611664 1.1000954 1.7965495 0.2797196 -0.0913715 0.0817188 0.3460272 0.0239245 0.0173277 0.0365618 1.1755004 1.5472035 0.013086 -0.1202208 -0.4072057 -0.3979211 0.0647743 -0.121523 -0.0093173 -0.0272429 -0.6097058 -0.004539 0.0287034 0.2996464 1.1873669 -0.1447007 0.0685684 -0.1109476 -0.1026964 0.82051 0.1802252 -0.0451616 0.3783688 0.3051686 -0.01876 -0.0974081 -0.0164784 0.2773916 0.0307987 -0.0212525 0.0341165 -0.1339003 0.0331337 -0.0642519 -0.0131138 -0.0867584 -0.0374632 -0.0480062 0.0464817 0.0265601 0.0888783 0.0348371 -0.0209758 0.0322715 -0.0115593 0.1328091 0.0303485 0.0082671 -0.0661172 -0.0944366 0.0256688 0.0841751 -0.004417 0.0895781 -0.0142511 unknown
polarizability: 94.2038653|6.3263232|70.2429371|-2.8639008|-2.50029|54.651226 unknown
InChI: InChI=1S/C6H3F7O/c1-14-3-2(7)4(8,9)6(12,13)5(3,10)11/h1H3
charge 0 multiplicity 1
17 atoms
F  1.254233 -1.390862 -1.31044
F  1.722618 -1.586619 0.903113
F  -0.808131 -1.361328 1.570455
F  -1.232333 -1.727025 -0.630715
F  2.180267 0.992712 1.144241
F  2.243892 1.023323 -1.12097
F  0.050384 2.768744 -0.179559
O  -2.27704 1.039521 0.177174
C  1.002917 -0.833709 -0.037361
C  -0.545091 -0.848702 0.259496
C  1.405665 0.690804 -0.021577
C  -0.996282 0.587313 0.117114
C  0.095304 1.400473 -0.045331
C  -3.395753 0.067216 0.340886
H  -3.511095 -0.53046 -0.577272
H  -4.275053 0.702876 0.508038
H  -3.216101 -0.584676 1.211609
