program: Orca
programVersion: 5.0.2
elementType: Cl Cl O O O N C C C C C C C C C C C C C C C C C C C C C C H H H H H H H H H H H H H H H H H H H
charge: 0
multiplicity: 1
keywords: wb97x-d3
keywords: def2-TZVPP
keywords: def2/J RIJCOSX
keywords: DEFGRID2
keywords: scfconv7
keywords: smallprint printgap noloewdin
keywords: NOSOSCF
formula: C22H19Cl2NO3
InChI: InChI=1/C22H19Cl2NO3/c1-22(2)17(12-19(23)24)20(22)21(26)28-18(13-25)14-7-6-10-16(11-14)27-15-8-4-3-5-9-15/h3-12,17-18,20H,1-2H3
47 atoms
Cl -2.666711 5.048993 0.711953
Cl -4.245311 4.670223 -1.674532
O  1.448518 0.288921 -1.283366
O  1.508081 1.661051 0.487146
O  1.632356 -4.331619 0.784143
N  3.753105 -0.494589 -3.529658
C  -1.541574 0.918453 0.587593
C  -1.390064 2.285514 -0.014019
C  -0.580499 1.134863 -0.566612
C  -1.020606 0.707477 1.987981
C  -2.766623 0.093066 0.275029
C  -2.435606 2.881294 -0.859825
C  0.879814 1.094296 -0.361284
C  -3.02933 4.046268 -0.63374
C  2.831378 0.027804 -1.140259
C  3.101122 -1.141633 -0.217434
C  3.329804 -0.264103 -2.487102
C  2.185185 -2.177959 -0.114717
C  4.301622 -1.194594 0.476988
C  2.480702 -3.269218 0.691927
C  4.590792 -2.297088 1.264644
C  3.682316 -3.33663 1.381056
C  0.310137 -4.11155 1.045363
C  -0.105018 -3.209911 2.017749
C  -0.61727 -4.867311 0.343022
C  -1.458922 -3.07722 2.285981
C  -1.967811 -4.724124 0.622185
C  -2.395842 -3.82776 1.590441
H  -0.827641 2.985272 0.594487
H  -0.906507 0.722623 -1.515183
H  -0.664495 -0.315659 2.114847
H  -1.829773 0.870289 2.701793
H  -0.209109 1.381624 2.248497
H  -3.593577 0.378044 0.92742
H  -2.558408 -0.965666 0.4371
H  -3.106982 0.20645 -0.753529
H  -2.757801 2.336645 -1.738847
H  3.35842 0.913332 -0.769227
H  1.252985 -2.151855 -0.665005
H  5.011826 -0.380792 0.401928
H  5.526801 -2.342671 1.804497
H  3.897564 -4.19882 1.998023
H  0.620997 -2.628559 2.572383
H  -0.276288 -5.565381 -0.410025
H  -1.781557 -2.384887 3.052677
H  -2.68889 -5.316014 0.074146
H  -3.449743 -3.720167 1.808322
totalener: -2050.65988811 hartree
nucrepener: 2789.97379777 hartree
electener: -4840.63368588 hartree
oneelecener: -8354.74723574 hartree
twoeener: 3514.11354985 hartree
kineticenergy: 2044.53447757 hartree
xcener: -151.872162359159 hartree
chargesum: -0.0000000
charge: -0.038733 -0.041562 -0.279783 -0.363928 -0.300054 0.002431 0.113658 0.021841 -0.105464 -0.252823 -0.239718 -0.193449 0.327769 0.040802 0.304242 0.075830 -0.255375 -0.122953 -0.174221 0.152722 -0.091071 -0.182178 0.198010 -0.105917 -0.187782 -0.192730 -0.090156 -0.137540 0.092625 0.082514 0.061079 0.095216 0.109019 0.097205 0.096265 0.073663 0.102127 0.129891 0.132332 0.110681 0.129509 0.132325 0.140256 0.130390 0.141727 0.128744 0.132566
qa: -0.0387 -0.0416 -0.2798 -0.3639 -0.3001 0.0024 0.1137 0.0218 -0.1055 -0.2528 -0.2397 -0.1934 0.3278 0.0408 0.3042 0.0758 -0.2554 -0.1230 -0.1742 0.1527 -0.0911 -0.1822 0.1980 -0.1059 -0.1878 -0.1927 -0.0902 -0.1375 0.0926 0.0825 0.0611 0.0952 0.1090 0.0972 0.0963 0.0737 0.1021 0.1299 0.1323 0.1107 0.1295 0.1323 0.1403 0.1304 0.1417 0.1287 0.1326
va: 1.2889 1.2646 2.1036 2.1412 2.1023 3.1212 3.6888 3.8661 3.8894 3.9065 3.9106 3.8971 4.2527 4.2460 3.8206 3.6781 4.0135 3.9268 4.0479 3.8931 3.9477 4.0381 3.8516 3.8491 4.0231 3.9156 3.9432 3.9037 1.0438 1.0387 1.0189 1.0019 1.0265 1.0040 1.0063 1.0118 1.0256 1.0246 1.0222 1.0112 0.9993 1.0095 1.0005 1.0122 0.9932 0.9974 0.9985
dispcorr: -0.026445700 hartree
energy: -2050.686333808290
dipole: 5.54519 -6.32555 -0.78035 -31.54557 30.82811 -0.71746 14.16245 -12.87494 1.28751
magnitude: 1.66775 au
magnitude: 4.23908 debye
