program: Gaussian 09
title: 000074477
version: EM64L-G09RevD.01
frameworkgroup: C1[X(C14H10O3)]
method: RPBEPBE
basis: SDD
operation: Freq
keyword: #pfreq=noraman
keyword: PBEPBE/SDD
title: #p freq=noraman PBEPBE/SDD
converged: NO YES NO YES
title: Mulliken charges:
elementType: O O O C C C C C C C C C C C C C C H H H H H H H H H H
charge: -0.261371 -0.241625 -0.191197 0.189360 0.170624 0.036076 0.416638 -0.468035 0.248835 -0.381732 -0.409953 -0.275679 0.367807 -0.306861 0.116538 -0.795260 -0.676612 0.289161 0.260466 0.243147 0.246366 0.253588 0.232712 0.235361 0.235344 0.246122 0.220180
chargesum: 0.00000
title: Mulliken charges with hydrogens summed into heavy atoms:
elementType: O O O C C C C C C C C C C C C C C
charge: -0.261371 -0.241625 -0.191197 0.189360 0.170624 0.036076 0.416638 -0.178874 0.248835 -0.121266 -0.166806 -0.029313 0.367807 -0.053273 0.116538 -0.091844 -0.210310
polarizability: 3.04306209e+02 1.68717408e+01 1.81972125e+02 -5.14028372e-03 -7.87206711e-04 6.67081129e+01
1716.lowfreq: -7.0456 -6.7606 -2.3864 -0.0004 0.0004 0.0008 58.0593 68.7466 97.3942
frequency: 58.0466 68.7452 97.3941 102.7101 144.4797 161.5586 206.2612 208.7343 289.6352 292.7683 295.1966 367.0850 413.8871 418.2104 441.7339 475.2446 487.2878 532.0154 548.1987 572.3963 608.3551 617.6656 620.9951 689.5114 690.9936 714.2808 738.9853 757.5249 769.8563 796.0460 828.0804 846.3811 853.8836 880.6866 933.5637 941.4502 951.5217 980.0999 990.5409 999.4448 1032.3553 1053.9302 1066.4498 1093.3996 1153.3826 1160.8409 1218.9936 1231.6388 1251.1651 1293.1533 1324.5502 1389.0708 1395.4822 1410.0899 1417.7949 1448.2030 1465.3643 1474.9067 1483.3170 1554.6163 1566.8251 1613.9888 1618.6593 1645.8564 1693.5177 2980.2782 3058.8483 3100.7438 3112.2657 3136.7246 3145.4866 3184.9134 3188.6803 3222.6138 3243.9472
redmass: 3.2742 4.4939 6.6231 4.5422 2.9459 1.2519 5.0947 6.4414 5.8862 3.7371 4.6345 6.1279 6.5697 3.6874 4.2949 3.7870 5.3020 4.9373 3.4829 4.0588 7.1828 2.0763 3.6149 6.9386 3.7923 7.8635 1.5420 7.1878 5.0829 1.4601 6.2238 1.5431 1.5521 6.9144 2.3625 1.3326 1.3318 4.4830 1.3336 1.3559 3.4325 1.4964 2.4845 2.9765 1.3919 1.7149 1.6841 1.5984 3.4629 4.0578 4.7226 2.2250 1.2107 3.4354 1.3456 4.5175 1.0447 1.2007 3.6305 5.7674 7.1694 7.9235 8.3169 5.5543 10.9209 1.0374 1.0979 1.0985 1.0614 1.0906 1.0898 1.0961 1.0954 1.1154 1.0982
irintensity: 0.4439 5.3538 1.0708 2.1238 0.3913 0.7358 0.0331 0.5621 4.4312 1.8705 2.1513 1.0598 1.9222 1.5997 4.2821 3.3878 0.2049 35.8166 0.5204 0.3460 2.1767 0.1248 5.0921 12.3763 4.5663 7.4845 2.4580 57.4222 21.8228 9.8077 0.0559 34.9612 78.5571 10.4946 3.2307 0.3292 72.3360 103.1722 0.2325 3.6613 0.3109 4.3429 96.7409 36.6790 14.2764 28.3296 2.5263 1.3497 10.1043 70.6550 16.0533 27.7628 19.8078 14.7272 2.6398 0.5152 16.9757 33.1398 6.4811 50.3803 4.0937 6.7730 220.2775 1.6378 532.7256 18.8560 18.6758 23.2542 2.3447 11.4535 5.8725 3.3335 2.9575 11.2096 6.6018
temp: 298.150 k
press: 1.00000 atm
elementType: 8 8 8 6 6 6 6 6 6 6 6 6 6 6 6 6 6 1 1 1 1 1 1 1 1 1 1
symmnumber: 1
zpe: 525301.2 jmol-1
zpe.correction: 0.200077 hartree
zpe.thermalcorrener: 0.213858 hartree
zpe.thermalcorrenthalpy: 0.214803 hartree
zpe.thermalcorrgfe: 0.159462 hartree
zpe.sumelectzpe: -763.975669 hartree
zpe.sumelectthermal: -763.961887 hartree
zpe.sumelectthermalent: -763.960943 hartree
zpe.sumelectthermalfe: -764.016283 hartree
dipole: 1.7401 3.8588 -0.0014
dipole: 4.2330
quadrupole: -87.9719 -97.9552 -101.8321
quadrupole: -22.0318 -0.0090 -0.0014
quadrupole: 7.9478 -2.0355 -5.9124 -22.0318 -0.0090 -0.0014
hfenergy: -764.1757457 hartree
pointgroup: C01 [X(C14H10O3)]
dipole: 0.7119276 -1.5055601 -0.0009631 debye
polarizability: 304.8758375|-14.6508093|181.4023511|0.0369138|0.1239548|66.7082585 unknown
InChI: InChI=1S/C14H10O3/c1-8(2)12-7-10-11(16-12)5-3-9-4-6-13(15)17-14(9)10/h3-7H,1H2,2H3
charge 0 multiplicity 1
27 atoms
O  2.264481 -1.133363 0.0007
O  -1.772816 1.302119 0.002724
O  -3.684456 2.60248 0.003748
C  0.25513 0.00182 0.001612
C  0.871248 -1.281797 0.000283
C  -1.157891 0.052824 0.001359
C  -1.90996 -1.159105 -0.000211
C  1.318809 0.978228 0.003073
C  2.52095 0.280868 0.002235
C  0.17147 -2.504356 -0.001302
C  -1.230316 -2.421063 -0.001531
C  -3.351738 -1.042669 -0.000397
C  3.914209 0.720394 0.002841
C  -3.977737 0.185609 0.000934
C  -3.23479 1.442559 0.002747
C  4.130299 2.224203 0.004439
C  4.946562 -0.174635 0.002732
H  1.200041 2.058596 0.004393
H  0.697588 -3.461516 -0.002312
H  -1.830493 -3.337561 -0.002731
H  -3.95258 -1.959673 -0.001672
H  -5.06618 0.281311 0.000773
H  5.206055 2.463418 0.005257
H  3.674701 2.695261 -0.886673
H  3.673749 2.69358 0.895961
H  4.766648 -1.253854 0.002635
H  5.986617 0.166922 0.004085
