program: Orca
programVersion: 5.0.2
elementType: Cl Cl O O O N C C C C C C C C C C C C C C C C C C C C C C H H H H H H H H H H H H H H H H H H H
charge: 0
multiplicity: 1
keywords: wb97x-d3
keywords: def2-TZVPP
keywords: def2/J RIJCOSX
keywords: DEFGRID2
keywords: scfconv7
keywords: smallprint printgap noloewdin
keywords: NOSOSCF
formula: C22H19Cl2NO3
InChI: InChI=1/C22H19Cl2NO3/c1-22(2)17(12-19(23)24)20(22)21(26)28-18(13-25)14-7-6-10-16(11-14)27-15-8-4-3-5-9-15/h3-12,17-18,20H,1-2H3
47 atoms
Cl -0.355203 5.029537 -0.643099
Cl -3.053921 5.973182 -1.046626
O  1.41739 0.969046 -1.141529
O  1.069435 1.455186 1.013087
O  0.677176 -3.942748 -0.39188
N  4.052407 0.222366 -3.010356
C  -1.908922 0.999137 -0.00411
C  -1.643799 2.420455 0.3712
C  -0.701265 1.729183 -0.576148
C  -1.728223 -0.076691 1.039172
C  -3.007507 0.695679 -0.994052
C  -2.502581 3.527498 -0.104914
C  0.65866 1.39508 -0.111746
C  -2.033041 4.688019 -0.542933
C  2.692006 0.455879 -0.792301
C  2.596873 -0.886554 -0.102446
C  3.434185 0.334787 -2.049205
C  1.673774 -1.823892 -0.546493
C  3.424936 -1.174598 0.969383
C  1.583194 -3.048994 0.092663
C  3.342103 -2.414417 1.586098
C  2.42531 -3.35703 1.155637
C  -0.137903 -4.619143 0.469105
C  -0.533895 -5.892424 0.084264
C  -0.605442 -4.064231 1.65491
C  -1.399124 -6.6128 0.89157
C  -1.462983 -4.802307 2.456963
C  -1.86416 -6.075722 2.083303
H  -1.236901 2.566532 1.369142
H  -0.773001 1.982031 -1.627947
H  -2.668516 -0.232701 1.570627
H  -0.968939 0.171545 1.777312
H  -1.453372 -1.026248 0.575496
H  -3.967162 0.592114 -0.483685
H  -2.808286 -0.244858 -1.509342
H  -3.116162 1.471051 -1.752939
H  -3.578616 3.406409 -0.060969
H  3.231454 1.159108 -0.148516
H  1.018351 -1.614632 -1.382672
H  4.129006 -0.435353 1.328736
H  3.99385 -2.646465 2.417419
H  2.361186 -4.321066 1.643263
H  -0.16401 -6.307667 -0.843964
H  -0.30748 -3.067842 1.955922
H  -1.705233 -7.605088 0.587857
H  -1.822805 -4.369515 3.381107
H  -2.533348 -6.644117 2.714515
totalener: -2050.65837465 hartree
nucrepener: 2780.11144025 hartree
electener: -4830.76981490 hartree
oneelecener: -8335.35927998 hartree
twoeener: 3504.58946507 hartree
kineticenergy: 2044.54181744 hartree
xcener: -151.872203452839 hartree
chargesum: 0.0000000
charge: -0.030679 -0.038802 -0.265073 -0.354635 -0.297558 0.001628 0.126339 -0.012573 -0.150842 -0.260158 -0.272361 -0.249221 0.330796 0.090233 0.314012 0.073808 -0.253411 -0.247558 -0.139834 0.210354 -0.101160 -0.149719 0.274467 -0.214078 -0.182439 -0.088471 -0.135794 -0.143437 0.110646 0.107068 0.094425 0.104235 0.082634 0.094662 0.099248 0.089295 0.119708 0.124956 0.128279 0.106372 0.130267 0.137160 0.126857 0.131685 0.126315 0.126563 0.125788
qa: -0.0307 -0.0388 -0.2651 -0.3546 -0.2976 0.0016 0.1263 -0.0126 -0.1508 -0.2602 -0.2724 -0.2492 0.3308 0.0902 0.3140 0.0738 -0.2534 -0.2476 -0.1398 0.2104 -0.1012 -0.1497 0.2745 -0.2141 -0.1824 -0.0885 -0.1358 -0.1434 0.1106 0.1071 0.0944 0.1042 0.0826 0.0947 0.0992 0.0893 0.1197 0.1250 0.1283 0.1064 0.1303 0.1372 0.1269 0.1317 0.1263 0.1266 0.1258
va: 1.3011 1.2674 2.1150 2.1467 2.1046 3.1199 3.7377 3.8459 3.8589 3.8957 3.9118 3.9136 4.2256 4.2087 3.8249 3.6325 4.0200 4.0330 4.0409 3.8706 3.9531 3.9628 3.7608 4.0364 3.9131 3.9373 3.9863 3.9643 1.0258 1.0244 1.0057 1.0151 1.0020 1.0010 1.0063 1.0005 1.0161 1.0171 1.0292 1.0133 1.0004 1.0005 1.0141 1.0024 0.9986 1.0006 1.0002
dispcorr: -0.026002854 hartree
energy: -2050.684377508103
dipole: -7.02247 5.69194 -1.33053 -40.20207 39.31442 -0.88765 13.56725 -12.14576 1.42149
magnitude: 2.13983 au
magnitude: 5.43901 debye
