program: Gaussian 09
title: 000074473
version: EM64L-G09RevD.01
frameworkgroup: C1[X(C14H10N2O2)]
method: RPBEPBE
basis: SDD
operation: Freq
keyword: #p
keyword: freq=noraman
keyword: PBEPBE/SDD
title: #p freq=noraman PBEPBE/SDD
converged: NO YES NO NO
title: Mulliken charges:
elementType: O O N N C C C C C C C C C C C C C C H H H H H H H H H H
charge: -0.308217 -0.201992 -0.675375 -0.689711 0.095591 0.300289 0.313676 0.291197 -0.103606 -0.281631 0.320356 -0.594349 -0.376776 -0.439760 0.539835 -0.415734 -0.436746 -0.202466 0.284713 0.285628 0.290777 0.224658 0.227264 0.232929 0.385350 0.300622 0.313539 0.319940
chargesum: 0.00000
title: Mulliken charges with hydrogens summed into heavy atoms:
elementType: O O N N C C C C C C C C C C C C C C
charge: -0.308217 -0.201992 0.010597 -0.056232 0.095591 0.300289 0.313676 0.291197 -0.103606 -0.281631 0.320356 -0.309636 -0.091148 -0.148983 0.539835 -0.191076 -0.209482 0.030463
polarizability: 3.35217823e+02 6.64084192e+00 2.00783007e+02 -6.78831513e-03 -7.92879477e-03 6.60124933e+01
1716.lowfreq: -5.6544 -0.0009 -0.0005 -0.0004 6.3114 11.2155 49.5104 83.9449 127.9995
frequency: 49.5100 83.9443 127.9986 152.2667 177.8222 193.2747 235.6406 279.0862 302.1402 326.3125 375.4209 396.3262 406.8331 419.9597 425.8695 438.3405 440.3908 452.3228 466.8848 490.1145 531.0042 547.9173 575.3168 580.0284 659.9957 666.9549 671.5260 723.3984 741.9283 762.2322 798.2049 824.3300 832.9616 843.1243 878.3212 890.4900 912.8683 940.2679 947.0779 990.3163 992.6417 1012.0132 1041.1827 1049.0599 1096.3576 1124.9053 1171.9093 1177.8860 1188.7980 1243.6178 1277.8874 1318.0460 1346.5964 1352.8835 1398.4068 1418.7234 1425.2841 1450.9794 1464.2111 1495.7145 1507.9513 1544.4016 1561.9920 1577.5242 1592.0892 1619.6730 1632.9482 1646.7615 3122.9361 3126.3984 3139.5342 3148.7581 3164.3655 3172.2334 3282.8765 3558.9549 3628.2727 3699.3333
redmass: 6.8590 4.7248 6.4928 6.4494 4.8112 4.6289 4.5105 5.1328 4.7853 7.1909 6.3134 3.9438 9.7755 1.0634 3.1497 3.9518 1.3742 2.9148 9.5128 1.2486 3.5425 6.5190 5.3156 4.8629 6.8251 3.0567 7.2193 2.6094 6.6342 5.2877 1.6711 7.0946 1.1438 1.5685 2.5015 6.0197 1.4258 4.1165 2.3085 1.3733 1.3875 2.0755 1.6222 2.4306 2.1433 1.4587 1.3202 2.4543 1.4100 1.5665 2.4498 2.3366 3.5635 3.9251 4.4684 8.4759 4.0507 3.1975 4.8635 4.8617 4.1214 7.3248 3.4091 7.0262 1.8682 6.2470 3.8685 1.3646 1.0876 1.0896 1.0915 1.0935 1.0947 1.0962 1.0619 1.0451 1.0898 1.1041
irintensity: 9.8608 0.1895 0.0479 0.1382 3.5714 0.1844 0.8023 1.1360 10.0463 0.4730 7.5228 1.4529 18.4829 33.4279 0.1093 0.8616 253.1555 19.2837 2.6273 126.9423 19.3925 0.5857 9.9307 0.1620 10.5355 16.0029 3.0570 26.4299 4.6678 4.2630 85.1533 22.6830 90.4540 48.2329 12.9620 10.2741 5.2169 5.3973 14.7793 3.4578 0.3170 23.4020 12.1323 4.5096 4.1140 23.1097 16.8352 25.2686 14.7069 9.4389 136.4170 194.1041 471.6183 154.0505 20.5092 4.3774 91.2366 91.6775 5.5983 51.1769 95.5055 261.1741 13.7576 59.0824 230.9841 108.9782 90.1148 340.8363 10.7103 20.5957 8.6423 28.0775 9.5738 9.1614 72.6753 154.8098 69.1446 24.9468
temp: 298.150 k
press: 1.00000 atm
elementType: 8 8 7 7 6 6 6 6 6 6 6 6 6 6 6 6 6 6 1 1 1 1 1 1 1 1 1 1
symmnumber: 1
zpe: 552273.0 jmol-1
zpe.correction: 0.210350 hartree
zpe.thermalcorrener: 0.224198 hartree
zpe.thermalcorrenthalpy: 0.225143 hartree
zpe.thermalcorrgfe: 0.170453 hartree
zpe.sumelectzpe: -798.265883 hartree
zpe.sumelectthermal: -798.252035 hartree
zpe.sumelectthermalent: -798.251090 hartree
zpe.sumelectthermalfe: -798.305780 hartree
dipole: 1.6593 -0.9889 -0.0052
dipole: 1.9317
quadrupole: -50.9855 -107.9057 -109.1618
quadrupole: 2.7240 0.0247 0.0350
quadrupole: 38.3655 -18.5547 -19.8108 2.7240 0.0247 0.0350
hfenergy: -798.476233 hartree
pointgroup: C01 [X(C14H10N2O2)]
dipole: 0.6650337 -0.3678302 -0.0020633 debye
polarizability: 334.6500341|10.9594252|201.3507958|-0.0065291|-0.0081436|66.0124933 unknown
InChI: InChI=1S/C14H10N2O2/c15-7-4-5-8-10(6-7)13(17)9-2-1-3-11(16)12(9)14(8)18/h1-6H,15-16H2
charge 0 multiplicity 1
28 atoms
O  -0.575581 -2.645836 0.002217
O  0.363822 2.806791 -0.001173
N  -3.15354 -2.219391 -0.0008
N  4.993311 0.618318 0.002347
C  -1.501215 -0.405371 -0.001758
C  1.265789 0.568405 -0.002203
C  -1.255194 1.008298 -0.001732
C  0.999841 -0.83347 -0.001907
C  -0.380227 -1.363732 -0.003495
C  0.140227 1.552369 -0.003895
C  -2.869068 -0.873564 0.000121
C  2.589046 1.049204 -0.000815
C  2.10082 -1.730729 0.000059
C  -2.319727 1.931631 0.000296
C  3.687292 0.146097 0.000986
C  -3.931092 0.089485 0.002402
C  3.419354 -1.260396 0.001435
C  -3.656576 1.463334 0.002478
H  2.742362 2.134387 -0.001177
H  1.884951 -2.803537 0.000295
H  -2.083421 2.999232 0.000205
H  -4.968131 -0.267775 0.003823
H  4.256417 -1.96896 0.002845
H  -4.485689 2.179197 0.004111
H  -2.34151 -2.860284 -0.004921
H  -4.117125 -2.545622 0.00045
H  5.781736 -0.02278 0.003657
H  5.185125 1.616398 0.002049
