program: Orca
programVersion: 5.0.2
elementType: Cl Cl O O O N C C C C C C C C C C C C C C C C C C C C C C H H H H H H H H H H H H H H H H H H H
charge: 0
multiplicity: 1
keywords: wb97x-d3
keywords: def2-TZVPP
keywords: def2/J RIJCOSX
keywords: DEFGRID2
keywords: scfconv7
keywords: smallprint printgap noloewdin
keywords: NOSOSCF
formula: C22H19Cl2NO3
InChI: InChI=1/C22H19Cl2NO3/c1-22(2)17(12-19(23)24)20(22)21(26)28-18(13-25)14-7-6-10-16(11-14)27-15-8-4-3-5-9-15/h3-12,17-18,20H,1-2H3
47 atoms
Cl -3.837524 3.941521 1.1943
Cl -3.235607 6.420829 -0.155338
O  2.070237 1.422863 -0.338657
O  0.389811 0.874128 1.033235
O  1.416592 -4.014793 1.31884
N  5.357351 1.166691 -0.26109
C  -1.200381 1.881518 -1.532095
C  -1.372627 2.804486 -0.358429
C  0.014712 2.393105 -0.781221
C  -1.647088 0.448361 -1.373368
C  -1.387831 2.413262 -2.932772
C  -1.788862 4.204402 -0.526503
C  0.796974 1.490578 0.088361
C  -2.816813 4.772832 0.091206
C  2.905619 0.478799 0.322047
C  2.61142 -0.930213 -0.132621
C  4.275752 0.87299 -0.011177
C  2.125657 -1.853112 0.777719
C  2.781192 -1.281626 -1.466779
C  1.825984 -3.143075 0.360709
C  2.467289 -2.566825 -1.87392
C  1.991571 -3.505003 -0.969742
C  0.486682 -4.9726 1.02802
C  -0.681711 -4.674873 0.338179
C  0.719764 -6.253699 1.504234
C  -1.615383 -5.676788 0.12489
C  -0.228176 -7.243292 1.29311
C  -1.395292 -6.96217 0.599184
H  -1.728173 2.320827 0.544363
H  0.610917 3.123282 -1.318046
H  -1.052938 -0.214686 -2.005324
H  -2.689488 0.354836 -1.681653
H  -1.573035 0.091679 -0.348799
H  -2.446856 2.438313 -3.194011
H  -0.881615 1.7685 -3.652568
H  -0.993221 3.419854 -3.066005
H  -1.221879 4.833558 -1.201682
H  2.788249 0.55186 1.408051
H  1.966965 -1.58017 1.812997
H  3.163965 -0.563483 -2.180665
H  2.605194 -2.851813 -2.908209
H  1.761591 -4.509772 -1.299538
H  -0.866899 -3.669703 -0.018891
H  1.633998 -6.464287 2.043359
H  -2.527937 -5.445445 -0.408397
H  -0.047145 -8.241265 1.669634
H  -2.131549 -7.73687 0.434191
totalener: -2050.66075282 hartree
nucrepener: 2696.04394678 hartree
electener: -4746.70469960 hartree
oneelecener: -8167.17310857 hartree
twoeener: 3420.46840896 hartree
kineticenergy: 2044.54321361 hartree
xcener: -151.871634951817 hartree
chargesum: 0.0000000
charge: -0.039064 -0.042678 -0.254639 -0.366503 -0.296381 -0.000201 0.076248 0.038199 -0.095018 -0.250147 -0.237121 -0.203064 0.332212 0.047036 0.314794 0.018034 -0.258890 -0.141821 -0.187961 0.191991 -0.113572 -0.140337 0.220844 -0.147816 -0.198593 -0.121535 -0.097164 -0.135839 0.090901 0.083184 0.087603 0.093289 0.097562 0.099805 0.094796 0.072849 0.100907 0.119534 0.112871 0.124061 0.131525 0.136031 0.135677 0.127430 0.126940 0.127287 0.126732
qa: -0.0391 -0.0427 -0.2546 -0.3665 -0.2964 -0.0002 0.0762 0.0382 -0.0950 -0.2501 -0.2371 -0.2031 0.3322 0.0470 0.3148 0.0180 -0.2589 -0.1418 -0.1880 0.1920 -0.1136 -0.1403 0.2208 -0.1478 -0.1986 -0.1215 -0.0972 -0.1358 0.0909 0.0832 0.0876 0.0933 0.0976 0.0998 0.0948 0.0728 0.1009 0.1195 0.1129 0.1241 0.1315 0.1360 0.1357 0.1274 0.1269 0.1273 0.1267
va: 1.2883 1.2634 2.1369 2.1411 2.1065 3.1192 3.7752 3.8241 3.8721 3.9121 3.9027 3.9056 4.2737 4.2459 3.8407 3.6300 4.0239 4.0464 4.0242 3.9240 3.9505 3.9421 3.8214 3.9402 4.0335 3.9506 3.9396 3.9553 1.0469 1.0355 1.0019 1.0029 1.0189 1.0034 1.0043 1.0097 1.0264 1.0171 1.0304 1.0175 1.0004 1.0028 1.0007 1.0130 1.0003 0.9987 1.0000
dispcorr: -0.023814807 hartree
energy: -2050.684567626602
dipole: 6.57058 -7.71750 -1.14692 -35.12856 34.07044 -1.05812 -15.22746 14.21620 -1.01126
magnitude: 1.85948 au
magnitude: 4.72643 debye
