program: Gaussian 09
title: 000074463
version: EM64L-G09RevD.01
frameworkgroup: C1[X(C12H10N2O)]
method: RPBEPBE
basis: SDD
operation: Freq
keyword: #p
keyword: freq=noraman
keyword: PBEPBE/SDD
title: #p freq=noraman PBEPBE/SDD
converged: YES YES NO NO
title: Mulliken charges:
elementType: O N N C C C C C C C C C C C C H H H H H H H H H H
charge: -0.251752 -0.469744 0.002318 0.497514 0.228083 0.135476 -0.344019 -0.446929 -0.285383 -0.213561 -0.197089 -0.252573 -0.424085 -0.187103 -0.321370 0.309990 0.309605 0.217537 0.236572 0.229189 0.227637 0.284865 0.230968 0.235859 0.247994
chargesum: 0.00000
title: Mulliken charges with hydrogens summed into heavy atoms:
elementType: O N N C C C C C C C C C C C C
charge: -0.251752 -0.159754 0.002318 0.497514 0.228083 0.135476 -0.034414 -0.229392 -0.048811 0.015628 0.030549 -0.021606 -0.139220 0.048757 -0.073376
polarizability: 2.47845192e+02 1.13036738e+00 1.42900411e+02 -2.65434424e+00 8.54101580e-01 6.26735763e+01
1716.lowfreq: -5.5419 -1.1455 -0.0006 -0.0005 0.0003 8.5270 38.4097 43.2744 76.0948
frequency: 38.3870 43.2302 76.0828 91.6817 163.2432 202.8205 254.7617 280.1539 337.2538 377.4979 406.2318 409.9184 479.0165 513.3484 572.2414 610.8880 614.7971 639.0972 694.9898 696.9869 702.5921 721.5140 770.9308 807.6687 826.8662 844.1069 862.9129 920.5817 931.0574 955.7077 974.6247 984.3281 985.6530 999.4206 1003.5254 1021.8397 1027.9917 1082.9268 1096.1223 1126.1620 1173.2754 1189.2787 1201.8330 1244.6595 1257.8117 1305.9003 1322.0981 1328.9465 1384.9203 1404.3352 1428.3601 1452.4197 1484.4456 1510.5050 1545.8857 1578.8929 1597.2516 1606.9148 1615.0437 3108.3311 3123.5565 3134.1712 3138.4342 3146.1028 3155.6386 3166.8772 3169.0845 3196.7982 3528.9469
redmass: 4.1441 5.8779 5.2997 5.6596 4.6329 5.3276 4.8147 5.1516 7.4193 3.1207 3.3913 3.9249 6.2078 2.7869 6.5215 7.4595 6.4706 1.2057 4.7639 2.2807 7.0929 1.7393 1.7109 3.0653 2.6113 1.2695 6.7563 1.4252 1.3631 1.5078 1.3523 5.8463 1.4588 3.6056 1.3088 3.6477 2.4156 1.9379 1.8855 1.7396 1.0518 1.1146 1.2927 3.3136 1.9303 8.1294 1.5410 1.2651 6.0298 2.2044 2.3435 2.1065 2.3729 2.1604 5.2716 5.7839 8.4059 4.0222 6.1980 1.0888 1.0894 1.0868 1.0903 1.0934 1.0925 1.0998 1.0997 1.0952 1.0760
irintensity: 0.7498 0.1535 1.3895 1.9507 3.2209 4.4514 1.3060 1.9803 3.2054 3.9444 2.2841 4.0405 1.6927 26.5443 12.9305 1.0718 1.0360 36.0540 5.3933 47.7737 2.0787 52.8242 103.7974 13.4221 8.9237 0.1147 18.7907 13.7908 2.9978 3.8970 0.2760 0.1891 2.4937 15.3593 3.1571 2.8116 3.4624 24.5802 14.0566 4.8710 0.4865 0.9850 5.1600 43.1823 57.3619 2.9443 67.4919 2.4738 79.3889 19.0497 97.6941 5.7123 66.1555 327.5573 12.0997 20.5718 110.1398 46.0506 31.8004 15.1527 8.6590 0.2112 15.0689 28.4325 4.2204 26.9344 21.4566 8.2632 9.9869
temp: 298.150 k
press: 1.00000 atm
elementType: 8 7 7 6 6 6 6 6 6 6 6 6 6 6 6 1 1 1 1 1 1 1 1 1 1
symmnumber: 1
zpe: 506318.7 jmol-1
zpe.correction: 0.192847 hartree
zpe.thermalcorrener: 0.204858 hartree
zpe.thermalcorrenthalpy: 0.205802 hartree
zpe.thermalcorrgfe: 0.153123 hartree
zpe.sumelectzpe: -646.970768 hartree
zpe.sumelectthermal: -646.958757 hartree
zpe.sumelectthermalent: -646.957813 hartree
zpe.sumelectthermalfe: -647.010492 hartree
dipole: -1.1411 5.2619 0.1921
dipole: 5.3877
quadrupole: -81.8929 -82.8079 -91.7837
quadrupole: 10.2173 3.1310 0.1283
quadrupole: 3.6019 2.6870 -6.2889 10.2173 3.1310 0.1283
hfenergy: -647.163615 hartree
pointgroup: C01 [X(C12H10N2O1)]
dipole: -0.4833144 -2.0616344 -0.0955054 debye
dipolederiv: -0.703428 0.1583466 0.0038917 -0.4072691 -0.8814418 0.1028966 0.0951277 0.0584517 -0.353097 -1.7084197 -0.271768 0.0692046 -0.5339726 -0.4415567 0.0043973 0.1559124 -0.0079266 -0.3036137 -0.4042051 0.0597435 0.0078804 0.049857 -0.320232 -0.0253454 -0.0035273 -0.0264373 -0.255022 1.1908773 0.0473252 -0.0061609 -0.1683903 0.0273476 0.0175886 0.00615 0.0089618 0.1009034 -0.2670518 -0.0035311 -0.0462079 0.171341 -0.2213088 -0.0414308 -0.0819738 -0.0516805 0.003963 1.7938537 0.0323823 -0.0625001 0.8521054 1.1418731 -0.193007 -0.2099148 -0.1071941 0.2368829 -0.2865579 0.0124324 -0.0005823 0.1376679 -0.0672879 -0.0203293 -0.0253658 -0.0124252 -0.1593987 -0.249145 -0.0244896 0.0062556 -0.1294471 0.0117339 -0.0474186 0.0186271 -0.043683 -0.2017277 0.0559682 0.010308 0.0519895 -0.0971124 0.0660466 0.0715155 0.0956209 0.0620763 -0.0780828 0.0742407 -0.036452 0.0090877 -0.1214919 0.1406389 -0.0541509 0.0243693 -0.0518413 -0.1321169 0.0416683 0.0137857 0.0001036 0.1383239 0.1146205 -0.047938 -0.0237605 -0.0474178 -0.1296935 -0.0309042 -0.0201495 0.0060232 -0.0376072 -0.1396152 -0.0074694 0.0073609 -0.0084269 -0.1794693 0.110221 0.0267187 0.0380474 0.008589 0.2418423 0.1041949 -0.0141379 0.0900209 -0.0037993 -0.3416308 -0.0071588 -0.0288825 -0.1879123 0.0543832 0.0385326 -0.0717175 0.0535255 -0.0871575 0.355062 -0.1263986 0.0160945 0.0881306 0.111707 0.0706601 0.0947005 0.0481959 -0.0380728 0.2092596 -0.0004098 -0.0030614 0.0695498 0.0941173 0.0376795 -0.0303544 0.0364267 0.2834456 0.1721512 -0.0583238 0.0090713 -0.0329828 0.0684168 0.022661 0.0122561 0.0152559 0.1779635 0.0154446 0.1181941 -0.0244141 0.0963103 -0.0491004 0.0449586 -0.0199891 0.04011 0.1572149 0.0036697 -0.0955693 -0.0552956 -0.0986631 0.0373119 -0.0470357 -0.0744938 -0.0346754 0.1098868 0.0251232 0.0710344 -0.0158837 0.1031658 -0.0629821 0.0432186 -0.0216167 0.0419548 0.1449401 0.0083221 -0.0881155 0.0168283 -0.11377 -0.0556895 0.0412321 0.0218225 0.040265 0.1500597 0.1146944 0.0476676 0.0101722 0.0499484 0.021417 -0.0421518 0.0559183 -0.03131 0.1233601 -0.1391812 0.0102663 -0.0045078 0.0094255 0.0937026 0.0150687 -0.003793 0.0141815 0.1662537 0.0591242 0.0466433 0.0052658 0.0887984 -0.0590886 -0.0716719 0.0144615 -0.0773001 0.1339149 -0.0991566 0.077518 -0.0024195 0.0654057 0.0731444 -0.0166551 -0.0216823 -0.0091077 0.1324626 unknown
polarizability: 247.7728202|-2.905562|142.9448672|2.8279385|1.5632488|62.701491 unknown
InChI: InChI=1S/C12H10N2O/c15-12(10-5-4-8-13-9-10)14-11-6-2-1-3-7-11/h1-9,14H
charge 0 multiplicity 1
25 atoms
O  0.248589 1.879886 -0.213702
N  -0.489382 -0.332883 0.095673
N  4.251685 0.689186 0.461304
C  -1.906587 -0.182758 0.059788
C  1.911255 0.127589 -0.028519
C  0.495268 0.643807 -0.065115
C  -2.550134 1.059463 -0.188854
C  -2.687618 -1.350084 0.28296
C  2.301052 -1.172423 -0.442192
C  -3.960548 1.110368 -0.213266
C  -4.094283 -1.280052 0.256881
C  -4.741266 -0.046892 0.007337
C  2.931108 1.020127 0.400496
C  3.665451 -1.52974 -0.388964
C  4.600548 -0.574869 0.072164
H  -0.160297 -1.275933 0.31436
H  -1.945168 1.952971 -0.350314
H  -2.192741 -2.311347 0.476019
H  1.568988 -1.885553 -0.840438
H  -4.451435 2.070992 -0.405282
H  -4.683596 -2.187035 0.43055
H  2.660997 2.038857 0.696995
H  -5.834586 0.009265 -0.012881
H  4.002961 -2.51946 -0.711236
H  5.668638 -0.81358 0.125937
