program: Gaussian 09
title: 000074469
version: EM64L-G09RevD.01
frameworkgroup: C1[X(C10H12O4)]
method: RPBEPBE
basis: SDD
operation: Freq
keyword: #pfreq=noraman
keyword: PBEPBE/SDD
title: #p freq=noraman PBEPBE/SDD
converged: YES YES NO NO
title: Mulliken charges:
elementType: O O O O C C C C C C C C C C H H H H H H H H H H H H
charge: -0.277354 -0.270685 -0.420305 -0.222489 0.423537 0.191937 -0.631033 -0.534240 0.334322 -0.353070 -0.373531 0.207242 -0.533641 -0.536900 0.271289 0.256056 0.256936 0.235531 0.238898 0.224711 0.216145 0.243134 0.219627 0.243606 0.217019 0.373257
chargesum: 0.00000
title: Mulliken charges with hydrogens summed into heavy atoms:
elementType: O O O O C C C C C C C C C C
charge: -0.277354 -0.270685 -0.047047 -0.222489 0.423537 0.191937 -0.103688 -0.277304 0.334322 -0.117538 -0.134633 0.207242 0.150349 0.143352
polarizability: 1.66557864e+02 8.75390642e+00 1.21011231e+02 -8.24219014e+00 8.47500646e+00 7.91840923e+01
1716.lowfreq: -6.4422 -3.6470 -0.0010 -0.0004 0.0002 4.0214 25.0913 42.0968 62.4982
frequency: 24.9930 42.0841 62.4808 91.5394 97.5977 152.1382 176.9362 226.6830 226.8768 245.2575 257.3618 293.7535 326.4336 368.1482 383.6272 448.7137 477.1930 506.2581 544.3517 551.3482 576.1237 638.8200 651.9448 684.4979 729.2431 761.2625 791.2379 846.2938 893.7188 902.2819 911.0499 932.4657 991.2826 1015.5859 1044.0182 1112.8492 1115.0602 1122.0633 1143.3241 1156.7794 1175.9858 1191.4666 1209.7148 1244.4109 1259.2018 1281.9270 1339.9866 1388.3648 1426.6936 1432.6897 1439.1097 1448.7857 1465.6866 1466.9007 1472.0948 1476.9518 1496.1969 1594.7113 1632.6067 1679.7020 2952.4145 2956.9688 3009.2001 3037.4195 3044.0940 3067.0149 3121.6982 3122.9210 3149.3935 3151.5390 3170.1462 3514.0341
redmass: 5.6196 8.0414 3.7888 3.6323 3.9568 4.1402 3.2907 1.8589 1.4168 2.3582 1.5038 3.8815 4.0685 5.7627 5.1283 3.1324 2.2477 3.8720 3.2886 4.0403 3.6213 1.4701 5.0837 5.2494 4.0575 4.3233 1.5349 3.3203 1.7580 1.4500 4.0848 2.3594 7.8581 4.0261 2.5290 1.2607 1.2725 2.0784 1.5290 1.3544 1.3842 1.2617 2.3864 1.7318 2.6946 1.5671 1.9306 7.7931 1.3834 1.1480 1.1839 2.3048 1.0503 1.0502 1.1121 1.0986 2.3706 7.8723 6.9833 8.4391 1.0333 1.0332 1.0607 1.1036 1.1037 1.0988 1.0988 1.0992 1.0871 1.0921 1.0956 1.0639
irintensity: 0.5879 0.6885 9.3870 0.3126 0.1859 7.2728 0.4932 3.8522 1.3189 0.3157 1.5850 5.1414 1.8511 0.4583 0.2562 3.7772 14.4626 23.9218 7.0168 37.4096 10.3543 131.7916 1.3751 37.5311 2.2296 5.9895 53.8868 9.0136 11.5037 5.0666 22.2963 18.7984 34.8519 41.7848 356.6500 0.1614 0.8046 26.6623 8.8428 1.1250 60.9689 10.7847 241.4455 0.5323 6.9406 34.6852 53.2223 12.7816 55.7414 29.2346 9.0092 13.4172 12.9718 13.2612 116.4895 2.4835 147.1380 13.9104 8.8481 189.7128 68.7910 71.5833 12.9050 52.8918 47.5714 1.7631 31.0932 19.0727 13.0782 3.5193 11.0875 19.9029
temp: 298.150 k
press: 1.00000 atm
elementType: 8 8 8 8 6 6 6 6 6 6 6 6 6 6 1 1 1 1 1 1 1 1 1 1 1 1
symmnumber: 1
zpe: 532001.5 jmol-1
zpe.correction: 0.202629 hartree
zpe.thermalcorrener: 0.216836 hartree
zpe.thermalcorrenthalpy: 0.217780 hartree
zpe.thermalcorrgfe: 0.160284 hartree
zpe.sumelectzpe: -688.084845 hartree
zpe.sumelectthermal: -688.070637 hartree
zpe.sumelectthermalent: -688.069693 hartree
zpe.sumelectthermalfe: -688.127190 hartree
dipole: -1.1393 2.6161 -0.4136
dipole: 2.8832
quadrupole: -64.1147 -70.9786 -88.1471
quadrupole: -2.4456 -1.6580 2.6181
quadrupole: 10.2988 3.4349 -13.7336 -2.4456 -1.6580 2.6181
hfenergy: -688.2874734 hartree
pointgroup: C01 [X(C10H12O4)]
dipole: -0.494704 -1.0056515 0.1751996 debye
dipolederiv: -1.0087434 0.682174 -0.0087006 0.5989413 -1.0239681 -0.0137625 -0.0236051 0.0053572 -0.2767431 -1.5570084 0.4331875 -0.1303589 0.555241 -0.5271977 0.0517237 -0.1271456 0.031455 -0.3100786 -1.3075908 -0.2870446 -0.3404889 -0.2278864 -0.48576 -0.0742436 -0.1929618 -0.0242322 -0.32593 -0.678142 -0.1205532 0.03646 -0.1245844 -0.3236435 -0.025747 -0.1570579 -0.0499826 -0.9225552 0.1568258 0.0260047 -0.001635 0.3112294 0.0471746 0.050603 0.0737919 0.0018076 -0.0750496 0.8270792 -0.7870414 0.0018457 -0.5612916 0.3211446 -0.0603336 0.0103442 -0.1274195 0.0525219 -0.1045947 -0.0058784 0.1039595 0.057717 0.1747997 -0.0305004 0.2213831 0.0423991 -0.1587728 -0.228619 0.1978727 0.0439098 -0.0851167 0.0273315 0.0240354 -0.0176264 0.0563189 -0.1448594 1.0465249 -0.5500205 0.062882 -0.8669947 0.3340335 -0.094715 0.0126799 -0.0485846 0.0750517 -0.1076793 0.2810789 0.0620624 -0.1407413 0.0068476 0.0172278 -0.0159461 0.0999606 -0.1647092 -0.1422726 -0.1015317 0.0085384 0.3445063 -0.0837199 0.0808314 0.0833994 0.0070724 -0.1876452 1.6474104 0.4003926 0.1229134 0.3090434 0.3009077 0.1082043 0.0723787 0.0402263 1.1992227 0.2252201 -0.0367662 -0.0222704 -0.3115872 0.8118887 0.0229396 -0.0854911 0.0938847 0.3183352 0.8432281 -0.0813161 0.0706325 0.2605052 0.1880207 0.0148746 0.1447962 -0.0444073 0.3493337 -0.004161 -0.00361 -0.0557985 0.0142619 0.0864198 0.0767519 -0.0494762 0.0330827 0.0436277 0.0617498 0.0353297 0.0446439 -0.0365983 -0.0669966 -0.0582718 0.0083205 -0.0240224 0.0947757 0.1099147 -0.0148475 -0.0210475 -0.0071095 -0.0563984 -0.039216 -0.0142318 -0.0406564 0.145197 0.0920628 0.0062173 -0.0092932 0.0121607 -0.0982957 -0.0424196 -0.0127093 -0.0490764 0.1501695 -0.069874 -0.05636 -0.0524065 -0.0741557 0.0740933 -0.0304249 -0.0576793 -0.0299972 0.1512926 0.0912595 -0.0746329 -0.0915873 0.0565691 -0.029577 -0.0078677 -0.014599 -0.0938465 -0.1366114 0.0257541 -0.1622261 0.1048883 0.0099178 -0.1018807 0.0532363 0.0889381 0.0678301 -0.0257317 -0.1146959 0.118851 -0.0206574 0.0628634 0.0436161 -0.00468 -0.0292363 0.0054331 0.1141516 -0.0045738 0.0244806 0.0310295 -0.1241509 0.056903 -0.1202329 -0.0670154 -0.0623814 -0.1428329 -0.0614912 0.1027329 -0.0130553 0.1524257 -0.0256984 -0.0006928 -0.0049449 -0.0090591 0.119044 -0.0259186 -0.0077385 0.0055878 -0.1935175 -0.027006 0.109159 0.0382299 0.1105225 -0.0450312 0.2883353 -0.0187548 0.0679464 0.008352 0.3769612 -0.0064793 0.1154643 0.0083156 0.1038269 unknown
polarizability: 165.638702|-10.6771015|122.1045145|8.9255923|7.5013429|79.0099711 unknown
InChI: InChI=1S/C10H12O4/c1-13-8-3-4-9(14-2)7(5-8)6-10(11)12/h3-5,11H,6H2,1-2H3
charge 0 multiplicity 1
26 atoms
O  1.509967 -1.700654 0.456292
O  -3.198362 1.36983 0.158412
O  3.91266 1.41636 0.277259
O  2.390236 0.951475 -1.411601
C  0.328679 0.368931 0.613471
C  0.276359 -1.030671 0.342808
C  1.651517 1.009013 0.973878
C  -0.856984 1.116723 0.538437
C  -2.089395 0.503269 0.197039
C  -0.944413 -1.647139 0.000998
C  -2.133985 -0.881521 -0.073938
C  2.625787 1.095315 -0.196082
C  1.539104 -3.122374 0.115864
C  -4.488882 0.785681 -0.204146
H  2.163926 0.44928 1.776562
H  1.499919 2.039017 1.347768
H  -0.84973 2.193763 0.735717
H  -0.991903 -2.719206 -0.211488
H  -3.070769 -1.37802 -0.343257
H  1.224004 -3.289044 -0.932606
H  0.894498 -3.71358 0.796251
H  2.588043 -3.428678 0.241598
H  -4.463385 0.349325 -1.222436
H  -5.202498 1.622414 -0.178514
H  -4.80042 0.008698 0.52217
H  4.528827 1.494991 -0.500857
