program: Orca
programVersion: 5.0.2
elementType: Cl Cl O O O N C C C C C C C C C C C C C C C C C C C C C C H H H H H H H H H H H H H H H H H H H
charge: 0
multiplicity: 1
keywords: wb97x-d3
keywords: def2-TZVPP
keywords: def2/J RIJCOSX
keywords: DEFGRID2
keywords: scfconv7
keywords: smallprint printgap noloewdin
keywords: NOSOSCF
formula: C22H19Cl2NO3
InChI: InChI=1/C22H19Cl2NO3/c1-22(2)17(12-19(23)24)20(22)21(26)28-18(13-25)14-7-6-10-16(11-14)27-15-8-4-3-5-9-15/h3-12,17-18,20H,1-2H3
47 atoms
Cl 3.230291 -0.358075 -2.057867
Cl 4.823955 -0.387456 0.345363
O  -2.041611 -1.377694 1.16386
O  -1.717502 -1.654544 -1.028276
O  -0.885342 3.330463 -0.386841
N  -4.883143 -2.34862 -0.457009
C  0.664391 -3.472672 -0.105391
C  1.198382 -2.100475 -0.388688
C  0.000742 -2.26998 0.534995
C  -0.002645 -4.216119 -1.236081
C  1.403116 -4.387721 0.841329
C  2.453853 -1.618568 0.198486
C  -1.304103 -1.756677 0.098779
C  3.368353 -0.888873 -0.427032
C  -3.30102 -0.786475 0.924822
C  -3.241504 0.615416 0.342566
C  -4.157001 -1.66572 0.116795
C  -2.03865 1.303793 0.264045
C  -4.427631 1.22519 -0.046948
C  -2.029552 2.603674 -0.228185
C  -4.399888 2.522774 -0.534994
C  -3.207386 3.219248 -0.630292
C  0.266803 2.974077 0.278237
C  0.302679 2.903742 1.664537
C  1.405546 2.749285 -0.478579
C  1.499121 2.591898 2.293268
C  2.600498 2.457181 0.164916
C  2.649908 2.367113 1.548477
H  0.958662 -1.718772 -1.374586
H  0.19922 -2.147978 1.593306
H  -0.814066 -4.842798 -0.862508
H  0.727538 -4.873293 -1.71105
H  -0.403175 -3.564203 -2.008283
H  1.803462 -3.872299 1.713086
H  2.232277 -4.876184 0.32707
H  0.731928 -5.167761 1.203563
H  2.66093 -1.879371 1.229315
H  -3.768595 -0.732515 1.912349
H  -1.111456 0.848859 0.584808
H  -5.372279 0.701189 0.029077
H  -5.320989 3.000097 -0.841047
H  -3.186042 4.230885 -1.014384
H  -0.590147 3.088706 2.248665
H  1.360876 2.812392 -1.558237
H  1.530087 2.529762 3.372981
H  3.493786 2.295816 -0.423116
H  3.580358 2.127046 2.045072
elementType: Cl O N C H
totalener: -2050.67127864 hartree
nucrepener: 2919.37491390 hartree
electener: -4970.04619254 hartree
oneelecener: -8614.50562460 hartree
twoeener: 3644.45943206 hartree
cpcmener: -0.04009021 hartree
kineticenergy: 2044.44960947 hartree
xcener: -151.868449291475 hartree
chargesum: 0.0000000
charge: -0.058372 -0.061275 -0.289950 -0.453054 -0.334421 -0.101836 0.091817 0.046284 -0.081510 -0.272370 -0.265892 -0.213034 0.392626 0.054039 0.482595 -0.034296 -0.235565 -0.231622 -0.254696 0.341679 -0.101617 -0.262230 0.288623 -0.201033 -0.237333 -0.140585 -0.116787 -0.179600 0.085952 0.099768 0.103017 0.099651 0.094289 0.093258 0.102031 0.099626 0.132360 0.158967 0.140303 0.142249 0.161302 0.147926 0.158901 0.146125 0.162995 0.147451 0.153242
qa: -0.0584 -0.0613 -0.2899 -0.4531 -0.3344 -0.1018 0.0918 0.0463 -0.0815 -0.2724 -0.2659 -0.2130 0.3926 0.0540 0.4826 -0.0343 -0.2356 -0.2316 -0.2547 0.3417 -0.1016 -0.2622 0.2886 -0.2010 -0.2373 -0.1406 -0.1168 -0.1796 0.0860 0.0998 0.1030 0.0997 0.0943 0.0933 0.1020 0.0996 0.1324 0.1590 0.1403 0.1422 0.1613 0.1479 0.1589 0.1461 0.1630 0.1475 0.1532
va: 1.2659 1.2435 2.1369 2.0457 2.0788 3.1014 3.7624 3.8520 3.8656 3.9021 3.9084 3.9107 4.1381 4.2043 3.7604 3.7830 4.0938 3.9372 3.9994 3.6879 3.8956 4.0155 3.6737 3.9361 4.0144 3.9053 3.8019 3.8710 1.0452 1.0358 0.9991 1.0000 1.0186 1.0055 1.0004 1.0009 1.0187 0.9894 1.0172 1.0086 0.9885 1.0075 0.9952 1.0110 0.9885 1.0101 1.0017
dispcorr: -0.028108615 hartree
energy: -2050.699387256186
dipole: -12.76648 13.87488 1.10840 -9.78559 9.76731 -0.01828 8.43960 -5.87117 2.56842
magnitude: 2.79744 au
magnitude: 7.11053 debye
