program: Orca
programVersion: 5.0.2
elementType: Cl Cl O O O N C C C C C C C C C C C C C C C C C C C C C C H H H H H H H H H H H H H H H H H H H
charge: 0
multiplicity: 1
keywords: wb97x-d3
keywords: def2-TZVPP
keywords: def2/J RIJCOSX
keywords: DEFGRID2
keywords: scfconv7
keywords: smallprint printgap noloewdin
keywords: NOSOSCF
formula: C22H19Cl2NO3
InChI: InChI=1/C22H19Cl2NO3/c1-22(2)17(12-19(23)24)20(22)21(26)28-18(13-25)14-7-6-10-16(11-14)27-15-8-4-3-5-9-15/h3-12,17-18,20H,1-2H3
47 atoms
Cl 1.476946 -5.907374 0.390909
Cl 3.743727 -5.654957 -1.373843
O  -0.886135 -0.144229 -1.378771
O  -1.521185 -1.721178 0.071628
O  -1.171251 3.791913 1.951508
N  -2.38264 1.889556 -3.504538
C  1.5476 -1.484056 0.809321
C  1.260474 -2.780717 0.107098
C  0.793536 -1.479548 -0.508947
C  0.82139 -1.203379 2.101866
C  2.938864 -0.901729 0.774567
C  2.314461 -3.535165 -0.582554
C  -0.644201 -1.172808 -0.547017
C  2.483905 -4.849398 -0.520515
C  -2.219635 0.345346 -1.40239
C  -2.558433 1.13583 -0.15998
C  -2.292354 1.203229 -2.586089
C  -1.676113 2.112489 0.287878
C  -3.737678 0.874883 0.519838
C  -1.999208 2.841125 1.423413
C  -4.042123 1.608721 1.658166
C  -3.181166 2.593191 2.11192
C  -0.355783 4.532155 1.127405
C  0.962351 4.703378 1.521217
C  -0.841998 5.141758 -0.022503
C  1.80372 5.497399 0.753503
C  0.013559 5.921346 -0.78669
C  1.336932 6.102433 -0.404572
H  0.478364 -3.375872 0.564637
H  1.359897 -1.108223 -1.355393
H  -0.109259 -1.756638 2.203813
H  0.598824 -0.138865 2.196778
H  1.458213 -1.482453 2.942768
H  2.904575 0.16281 1.010946
H  3.422672 -1.004726 -0.195689
H  3.571612 -1.386752 1.519974
H  3.013316 -2.982483 -1.199064
H  -2.94127 -0.46596 -1.541413
H  -0.750741 2.299623 -0.244283
H  -4.411213 0.105612 0.164979
H  -4.958972 1.413294 2.19754
H  -3.41939 3.167845 2.997745
H  1.324635 4.226648 2.422922
H  -1.875016 5.016417 -0.322088
H  2.831333 5.6346 1.06327
H  -0.362426 6.394196 -1.684325
H  1.997348 6.714252 -1.004201
elementType: Cl O N C H
totalener: -2050.67315103 hartree
nucrepener: 2740.56841130 hartree
electener: -4791.24156233 hartree
oneelecener: -8256.50314705 hartree
twoeener: 3465.26158472 hartree
cpcmener: -0.03679817 hartree
kineticenergy: 2044.45832564 hartree
xcener: -151.862245294208 hartree
chargesum: -0.0000000
charge: -0.057439 -0.060415 -0.286644 -0.458881 -0.339215 -0.101495 0.093916 0.032946 -0.070991 -0.267771 -0.266235 -0.206747 0.384781 0.038283 0.431826 0.025874 -0.224518 -0.218801 -0.210120 0.267428 -0.113135 -0.239456 0.284237 -0.249837 -0.193864 -0.124425 -0.143038 -0.185126 0.080852 0.102295 0.095035 0.100323 0.101707 0.099139 0.092808 0.102354 0.135465 0.145649 0.145990 0.150088 0.162235 0.150670 0.149797 0.158671 0.161976 0.162988 0.160819
qa: -0.0574 -0.0604 -0.2866 -0.4589 -0.3392 -0.1015 0.0939 0.0329 -0.0710 -0.2678 -0.2662 -0.2067 0.3848 0.0383 0.4318 0.0259 -0.2245 -0.2188 -0.2101 0.2674 -0.1131 -0.2395 0.2842 -0.2498 -0.1939 -0.1244 -0.1430 -0.1851 0.0809 0.1023 0.0950 0.1003 0.1017 0.0991 0.0928 0.1024 0.1355 0.1456 0.1460 0.1501 0.1622 0.1507 0.1498 0.1587 0.1620 0.1630 0.1608
va: 1.2679 1.2447 2.1252 2.0492 2.0645 3.1093 3.7290 3.8769 3.8386 3.9060 3.9075 3.8933 4.2034 4.2077 3.7023 3.5921 4.0902 3.9218 3.9703 3.7257 3.8956 4.0044 3.6749 4.0090 3.9164 3.8752 3.8812 3.9001 1.0472 1.0319 1.0161 0.9985 1.0009 1.0014 1.0050 1.0005 1.0156 1.0163 1.0178 1.0019 0.9879 1.0043 1.0067 0.9965 0.9878 0.9888 0.9896
dispcorr: -0.024235095 hartree
energy: -2050.697386126251
dipole: -3.60801 4.37943 0.77142 35.82120 -35.13859 0.68261 12.09036 -11.10440 0.98596
magnitude: 1.42589 au
magnitude: 3.62432 debye
