program: Orca
programVersion: 5.0.2
elementType: Cl Cl O O O N C C C C C C C C C C C C C C C C C C C C C C H H H H H H H H H H H H H H H H H H H
charge: 0
multiplicity: 1
keywords: wb97x-d3
keywords: def2-TZVPP
keywords: def2/J RIJCOSX
keywords: DEFGRID2
keywords: scfconv7
keywords: smallprint printgap noloewdin
keywords: NOSOSCF
formula: C22H19Cl2NO3
InChI: InChI=1/C22H19Cl2NO3/c1-22(2)17(12-19(23)24)20(22)21(26)28-18(13-25)14-7-6-10-16(11-14)27-15-8-4-3-5-9-15/h3-12,17-18,20H,1-2H3
47 atoms
Cl 1.807843 -5.473678 1.638758
Cl 3.072697 -6.436455 -0.766174
O  -1.552398 -0.842508 -1.510234
O  -1.462505 -1.693593 0.554657
O  0.162326 3.472802 0.306237
N  -3.706511 0.836608 -3.36981
C  1.622892 -1.469586 -0.289044
C  1.190677 -2.891556 -0.052389
C  0.371892 -2.007642 -0.961422
C  1.519301 -0.509476 0.870511
C  2.787684 -1.169939 -1.199453
C  1.914763 -4.026561 -0.637257
C  -0.953748 -1.538576 -0.526139
C  2.220969 -5.149969 -0.001088
C  -2.726814 -0.130114 -1.148829
C  -2.436416 1.012221 -0.200256
C  -3.256982 0.398661 -2.405826
C  -1.292091 1.776257 -0.383703
C  -3.319364 1.298197 0.829905
C  -1.020518 2.814808 0.492833
C  -3.042323 2.353885 1.687203
C  -1.892673 3.112412 1.533905
C  0.260429 4.812022 0.598498
C  -0.698791 5.723419 0.175775
C  1.392465 5.232808 1.279765
C  -0.518123 7.070562 0.453202
C  1.565673 6.585441 1.539495
C  0.610936 7.507648 1.134318
H  0.756949 -3.067737 0.925341
H  0.46648 -2.17062 -2.02936
H  0.726494 -0.76186 1.57149
H  1.351289 0.510208 0.51862
H  2.45777 -0.513225 1.427434
H  2.733435 -0.136637 -1.545606
H  2.819005 -1.807578 -2.081779
H  3.730627 -1.289828 -0.663186
H  2.226951 -3.950751 -1.672161
H  -3.485525 -0.795692 -0.723602
H  -0.599274 1.568345 -1.19019
H  -4.209572 0.698468 0.968366
H  -3.720979 2.58002 2.49846
H  -1.680559 3.916673 2.226129
H  -1.575924 5.393038 -0.366473
H  2.132712 4.509786 1.597993
H  -1.265081 7.78216 0.126971
H  2.450659 6.91498 2.067843
H  0.745847 8.560203 1.344316
elementType: Cl O N C H
totalener: -2050.67211185 hartree
nucrepener: 2716.28480386 hartree
electener: -4766.95691571 hartree
oneelecener: -8207.96538123 hartree
twoeener: 3441.00846552 hartree
cpcmener: -0.03738111 hartree
kineticenergy: 2044.45816590 hartree
xcener: -151.862663603351 hartree
chargesum: -0.0000000
charge: -0.057583 -0.061413 -0.282389 -0.448011 -0.339883 -0.101103 0.101272 0.025444 -0.067795 -0.269465 -0.266363 -0.204438 0.367144 0.038065 0.426804 0.040133 -0.223905 -0.293826 -0.209114 0.286576 -0.125338 -0.187496 0.263073 -0.182423 -0.239221 -0.154701 -0.133858 -0.177117 0.079209 0.104715 0.096802 0.092387 0.107943 0.099831 0.093359 0.102054 0.135866 0.148669 0.144326 0.149615 0.163747 0.161865 0.160622 0.150164 0.162413 0.161766 0.161575
qa: -0.0576 -0.0614 -0.2824 -0.4480 -0.3399 -0.1011 0.1013 0.0254 -0.0678 -0.2695 -0.2664 -0.2044 0.3671 0.0381 0.4268 0.0401 -0.2239 -0.2938 -0.2091 0.2866 -0.1253 -0.1875 0.2631 -0.1824 -0.2392 -0.1547 -0.1339 -0.1771 0.0792 0.1047 0.0968 0.0924 0.1079 0.0998 0.0934 0.1021 0.1359 0.1487 0.1443 0.1496 0.1637 0.1619 0.1606 0.1502 0.1624 0.1618 0.1616
va: 1.2677 1.2436 2.1180 2.0569 2.0396 3.1095 3.7299 3.8950 3.8220 3.9001 3.9025 3.8939 4.2313 4.2064 3.6871 3.5746 4.0893 4.0327 3.9952 3.7018 3.8979 3.9303 3.7003 3.9062 3.9996 3.8906 3.8855 3.8885 1.0479 1.0305 1.0144 1.0043 1.0017 1.0017 1.0050 1.0011 1.0155 1.0131 1.0242 1.0014 0.9890 0.9935 0.9958 1.0055 0.9894 0.9884 0.9890
dispcorr: -0.024764560 hartree
energy: -2050.696876412612
dipole: -1.40545 2.16322 0.75777 42.12148 -40.80905 1.31243 3.05797 -2.22279 0.83518
magnitude: 1.73038 au
magnitude: 4.39827 debye
