program: Orca
programVersion: 5.0.2
elementType: Cl Cl O O O N C C C C C C C C C C C C C C C C C C C C C C H H H H H H H H H H H H H H H H H H H
charge: 0
multiplicity: 1
keywords: wb97x-d3
keywords: def2-TZVPP
keywords: def2/J RIJCOSX
keywords: DEFGRID2
keywords: scfconv7
keywords: smallprint printgap noloewdin
keywords: NOSOSCF
formula: C22H19Cl2NO3
InChI: InChI=1/C22H19Cl2NO3/c1-22(2)17(12-19(23)24)20(22)21(26)28-18(13-25)14-7-6-10-16(11-14)27-15-8-4-3-5-9-15/h3-12,17-18,20H,1-2H3
47 atoms
Cl 1.931137 -5.3775 1.657203
Cl 3.165617 -6.335346 -0.765377
O  -1.673853 -0.931099 -1.466891
O  -1.467042 -1.681753 0.628401
O  0.101526 3.424542 0.110644
N  -3.93842 0.636437 -3.290797
C  1.570152 -1.412269 -0.327713
C  1.190116 -2.841521 -0.052457
C  0.314548 -1.999525 -0.948932
C  1.478785 -0.436731 0.819565
C  2.692267 -1.092738 -1.283618
C  1.930582 -3.963759 -0.641803
C  -1.009549 -1.560112 -0.479426
C  2.286237 -5.068568 0.001175
C  -2.842692 -0.223382 -1.08018
C  -2.522053 0.961369 -0.195262
C  -3.444395 0.242231 -2.329844
C  -1.385506 1.714035 -0.453561
C  -3.364344 1.288536 0.856658
C  -1.074465 2.781699 0.374223
C  -3.049812 2.373393 1.662319
C  -1.903547 3.120013 1.43763
C  0.248461 4.748148 0.456206
C  -0.673398 5.703491 0.049062
C  1.379228 5.105012 1.173539
C  -0.455385 7.033337 0.376216
C  1.591271 6.442044 1.483311
C  0.674576 7.407821 1.092796
H  0.794262 -3.013294 0.941939
H  0.378651 -2.179953 -2.016288
H  0.717732 -0.69886 1.551334
H  1.271739 0.57224 0.45823
H  2.43535 -0.406889 1.343862
H  2.592204 -0.068068 -1.644789
H  2.712267 -1.744318 -2.1561
H  3.657261 -1.173273 -0.780326
H  2.214119 -3.893481 -1.685293
H  -3.567656 -0.880826 -0.588695
H  -0.725492 1.474196 -1.278624
H  -4.249439 0.697208 1.05223
H  -3.694854 2.632241 2.491081
H  -1.661909 3.945234 2.094367
H  -1.550304 5.416904 -0.518111
H  2.088236 4.346755 1.480767
H  -1.1726 7.780274 0.062841
H  2.475339 6.724458 2.039741
H  0.839805 8.447561 1.341187
elementType: Cl O N C H
totalener: -2050.67200255 hartree
nucrepener: 2722.98677813 hartree
electener: -4773.65878068 hartree
oneelecener: -8221.37888249 hartree
twoeener: 3447.72010182 hartree
cpcmener: -0.03723558 hartree
kineticenergy: 2044.46449791 hartree
xcener: -151.864103320196 hartree
chargesum: 0.0000000
charge: -0.057565 -0.061325 -0.283213 -0.447827 -0.338852 -0.100628 0.101487 0.025667 -0.066193 -0.269905 -0.266849 -0.204656 0.365510 0.038522 0.424878 0.038526 -0.224366 -0.288066 -0.210382 0.288713 -0.128867 -0.190041 0.250543 -0.177932 -0.227744 -0.155717 -0.138042 -0.171268 0.079382 0.104250 0.097099 0.091681 0.108502 0.099972 0.093654 0.102145 0.135772 0.148028 0.143870 0.149064 0.163598 0.160135 0.161434 0.151059 0.162396 0.162023 0.161529
qa: -0.0576 -0.0613 -0.2832 -0.4478 -0.3389 -0.1006 0.1015 0.0257 -0.0662 -0.2699 -0.2668 -0.2047 0.3655 0.0385 0.4249 0.0385 -0.2244 -0.2881 -0.2104 0.2887 -0.1289 -0.1900 0.2505 -0.1779 -0.2277 -0.1557 -0.1380 -0.1713 0.0794 0.1042 0.0971 0.0917 0.1085 0.1000 0.0937 0.1021 0.1358 0.1480 0.1439 0.1491 0.1636 0.1601 0.1614 0.1511 0.1624 0.1620 0.1615
va: 1.2678 1.2438 2.1164 2.0567 2.0409 3.1094 3.7273 3.8970 3.8214 3.8999 3.9030 3.8959 4.2310 4.2070 3.6930 3.5806 4.0879 4.0267 3.9928 3.7026 3.9055 3.9218 3.7086 3.9150 3.9948 3.8915 3.8854 3.8848 1.0478 1.0308 1.0148 1.0041 1.0020 1.0017 1.0050 1.0010 1.0157 1.0133 1.0239 1.0014 0.9891 0.9950 0.9951 1.0039 0.9893 0.9886 0.9890
dispcorr: -0.024954724 hartree
energy: -2050.696957272478
dipole: -1.91536 2.74922 0.83387 42.01961 -40.60335 1.41626 2.63138 -1.79261 0.83877
magnitude: 1.84518 au
magnitude: 4.69006 debye
