program: Orca
programVersion: 5.0.2
elementType: Cl Cl O O O N C C C C C C C C C C C C C C C C C C C C C C H H H H H H H H H H H H H H H H H H H
charge: 0
multiplicity: 1
keywords: wb97x-d3
keywords: def2-TZVPP
keywords: def2/J RIJCOSX
keywords: DEFGRID2
keywords: scfconv7
keywords: smallprint printgap noloewdin
keywords: NOSOSCF
formula: C22H19Cl2NO3
InChI: InChI=1/C22H19Cl2NO3/c1-22(2)17(12-19(23)24)20(22)21(26)28-18(13-25)14-7-6-10-16(11-14)27-15-8-4-3-5-9-15/h3-12,17-18,20H,1-2H3
47 atoms
Cl 1.887718 -5.420415 1.638208
Cl 3.137897 -6.365367 -0.781648
O  -1.629409 -0.89874 -1.476302
O  -1.462679 -1.687274 0.609272
O  0.105642 3.433441 0.21361
N  -3.853407 0.681987 -3.331102
C  1.592602 -1.427036 -0.312126
C  1.197357 -2.855277 -0.051425
C  0.337516 -1.998135 -0.948618
C  1.498333 -0.460066 0.842273
C  2.726681 -1.108962 -1.254536
C  1.931288 -3.979813 -0.64403
C  -0.987117 -1.550469 -0.488995
C  2.266106 -5.0961 -0.009829
C  -2.807007 -0.197441 -1.104382
C  -2.509736 0.976952 -0.197967
C  -3.380728 0.280021 -2.363027
C  -1.366331 1.732595 -0.415072
C  -3.381708 1.294433 0.832567
C  -1.080303 2.792588 0.431336
C  -3.092588 2.372965 1.656438
C  -1.941107 3.122352 1.471938
C  0.243567 4.764467 0.527563
C  -0.685503 5.709908 0.11291
C  1.384952 5.140451 1.218815
C  -0.462738 7.047432 0.405647
C  1.600911 6.48393 1.493744
C  0.677879 7.440227 1.094528
H  0.791925 -3.030953 0.938445
H  0.410792 -2.171471 -2.016564
H  1.306391 0.554047 0.486842
H  2.44901 -0.444953 1.377799
H  0.72571 -0.719952 1.562652
H  2.637634 -0.081107 -1.609491
H  2.751656 -1.754731 -2.131096
H  3.685388 -1.199623 -0.741095
H  2.226968 -3.90173 -1.6836
H  -3.541165 -0.862701 -0.637405
H  -0.682147 1.501016 -1.22242
H  -4.271043 0.700212 0.997856
H  -3.761704 2.623164 2.46859
H  -1.718808 3.942322 2.142098
H  -1.570506 5.412613 -0.435639
H  2.099737 4.390076 1.531803
H  -1.184598 7.786677 0.084614
H  2.493448 6.779398 2.029392
H  0.846504 8.485679 1.315167
elementType: Cl O N C H
totalener: -2050.67206583 hartree
nucrepener: 2719.37529062 hartree
electener: -4770.04735645 hartree
oneelecener: -8214.14205065 hartree
twoeener: 3444.09469420 hartree
cpcmener: -0.03733077 hartree
kineticenergy: 2044.46217564 hartree
xcener: -151.863555390625 hartree
chargesum: 0.0000000
charge: -0.057549 -0.061481 -0.282337 -0.447852 -0.338186 -0.100158 0.101208 0.025209 -0.067179 -0.269035 -0.266541 -0.204273 0.366638 0.038209 0.423180 0.040216 -0.224612 -0.292863 -0.211041 0.292339 -0.125908 -0.191787 0.260767 -0.183130 -0.236325 -0.154188 -0.134798 -0.175200 0.079236 0.104386 0.091622 0.108376 0.096778 0.099855 0.093581 0.102048 0.135700 0.148633 0.144671 0.149506 0.163646 0.160884 0.161264 0.150744 0.162394 0.161934 0.161418
qa: -0.0575 -0.0615 -0.2823 -0.4479 -0.3382 -0.1002 0.1012 0.0252 -0.0672 -0.2690 -0.2665 -0.2043 0.3666 0.0382 0.4232 0.0402 -0.2246 -0.2929 -0.2110 0.2923 -0.1259 -0.1918 0.2608 -0.1831 -0.2363 -0.1542 -0.1348 -0.1752 0.0792 0.1044 0.0916 0.1084 0.0968 0.0999 0.0936 0.1020 0.1357 0.1486 0.1447 0.1495 0.1636 0.1609 0.1613 0.1507 0.1624 0.1619 0.1614
va: 1.2678 1.2435 2.1164 2.0569 2.0426 3.1096 3.7299 3.8976 3.8202 3.8995 3.9027 3.8954 4.2304 4.2069 3.6929 3.5785 4.0884 4.0306 3.9961 3.7025 3.9010 3.9291 3.7011 3.9140 3.9979 3.8909 3.8853 3.8876 1.0477 1.0308 1.0048 1.0019 1.0148 1.0017 1.0050 1.0010 1.0157 1.0130 1.0235 1.0014 0.9890 0.9944 0.9954 1.0047 0.9893 0.9885 0.9891
dispcorr: -0.024830678 hartree
energy: -2050.696896510179
dipole: -1.73183 2.52723 0.79540 42.12420 -40.73249 1.39171 2.80955 -1.97996 0.82959
magnitude: 1.80492 au
magnitude: 4.58775 debye
