program: Gaussian 09
title: 000074472
version: EM64L-G09RevD.01
frameworkgroup: C1[X(C12H22O2)]
method: RPBEPBE
basis: SDD
operation: Freq
keyword: #pfreq=noraman
keyword: PBEPBE/SDD
title: #p freq=noraman PBEPBE/SDD
converged: YES YES NO NO
title: Mulliken charges:
elementType: O O C C C C C C C C C C C C H H H H H H H H H H H H H H H H H H H H H H
charge: -0.215718 -0.215718 0.033400 0.033384 -0.425069 -0.451312 -0.425065 -0.451315 -0.395294 -0.392115 -0.395297 -0.392109 -0.386576 -0.386576 0.198555 0.198556 0.196245 0.230909 0.216066 0.206340 0.196241 0.230917 0.216064 0.206345 0.202325 0.192961 0.195360 0.203678 0.202324 0.192963 0.195356 0.203679 0.199674 0.190573 0.199673 0.190573
chargesum: 0.00000
title: Mulliken charges with hydrogens summed into heavy atoms:
elementType: O O C C C C C C C C C C C C
charge: -0.215718 -0.215718 0.231955 0.231941 0.002085 -0.028906 0.002093 -0.028906 -0.000008 0.006923 -0.000010 0.006926 0.003672 0.003670
polarizability: 1.82390406e+02 -4.42873278e+00 1.21746371e+02 -4.24924306e-04 1.55022369e-04 1.12703815e+02
1716.lowfreq: -0.0005 -0.0004 0.0003 3.5030 6.1126 12.3357 35.4508 60.2584 60.9659
frequency: 6.9368 59.3224 60.6675 101.9096 120.6272 175.2359 195.3612 224.1578 227.6002 258.3544 319.1827 319.6365 375.5991 394.4480 425.1842 436.9506 439.9293 471.3056 475.7359 538.2015 581.5359 782.3882 784.1868 788.0165 792.9872 809.6840 841.0856 843.6380 877.3028 880.8278 895.7156 896.5842 914.9966 921.4938 936.3109 941.2159 1015.2056 1020.0896 1044.3088 1045.1878 1052.8701 1053.5585 1075.6640 1081.3063 1110.5329 1110.5820 1147.4257 1149.9796 1187.2985 1193.9835 1238.5949 1241.0503 1248.8670 1250.1935 1254.2533 1256.2180 1291.2016 1297.5210 1306.1067 1306.2841 1329.8008 1330.6726 1333.2220 1335.3545 1343.1131 1343.1343 1346.6138 1351.3017 1356.2977 1360.4180 1463.8722 1464.3671 1464.5656 1464.5693 1465.6138 1466.0679 1472.1694 1472.2056 1481.0140 1481.2459 2961.1384 2962.4810 2968.0107 2968.1429 2969.8972 2969.9323 2971.3945 2971.6869 2986.3416 2986.5652 2990.9989 2991.3468 3030.4740 3030.7924 3032.1917 3032.2188 3041.7454 3041.7651 3055.9714 3056.3125 3065.9873 3066.0844
redmass: 4.0653 3.8743 2.9321 3.7844 3.1746 3.9580 3.4046 1.8138 1.8709 3.8425 1.8105 2.0056 3.1112 3.9835 2.7601 2.4495 3.4561 1.9789 1.9438 2.2679 2.7635 2.0790 1.6623 1.5534 2.1888 5.1999 2.1614 2.2385 1.6319 1.7157 1.6432 1.8229 1.8543 1.8238 2.8330 2.3018 3.0833 2.8853 1.9840 2.0481 1.0749 1.0879 1.3595 1.3427 2.5192 2.5094 2.3168 2.2777 1.4862 1.5099 1.3121 1.3073 1.3141 1.3107 1.2977 1.3179 1.2074 1.2182 1.3416 1.3587 1.3991 1.3704 1.4079 1.4705 1.4666 1.4661 1.4735 1.5135 1.4254 1.4535 1.0850 1.0857 1.0895 1.0895 1.0898 1.0897 1.0831 1.0833 1.0939 1.0940 1.0823 1.0822 1.0639 1.0640 1.0606 1.0606 1.0647 1.0654 1.0617 1.0616 1.0629 1.0631 1.0958 1.0956 1.0983 1.0983 1.1014 1.1013 1.1025 1.1024 1.1013 1.1011
irintensity: 1.3120 0.6606 0.2166 0.0923 0.7521 0.9267 2.1168 0.3754 0.3187 2.5105 1.0478 0.2382 3.8748 1.3509 0.0870 0.2540 0.8066 0.0184 2.9122 5.4135 4.2104 0.2221 1.5001 1.1488 0.0218 0.9492 17.4541 0.0084 1.5425 3.8384 19.7125 7.7815 0.0512 2.2856 25.7319 0.2653 94.3460 1.5471 9.1034 0.5604 0.0600 0.5459 6.6909 3.4124 0.3442 0.6480 6.5165 1.1008 6.2335 0.2600 5.6227 0.0465 7.9984 1.3644 2.5395 0.2335 3.0148 0.3694 1.0233 0.2724 19.7740 0.3103 15.0702 0.0718 0.5934 0.3114 0.2748 0.0785 45.8611 2.2136 0.9667 0.0404 4.2232 8.1845 23.9475 3.1917 13.9261 27.2677 7.6802 2.0641 5.0175 19.0481 75.7778 1.9470 31.2378 43.0188 46.7179 38.9074 12.3974 6.8680 53.8666 25.3321 132.5810 0.3410 77.3738 50.2989 46.9802 59.6776 0.3629 85.2378 50.5183 59.7834
temp: 298.150 k
press: 1.00000 atm
elementType: 8 8 6 6 6 6 6 6 6 6 6 6 6 6 1 1 1 1 1 1 1 1 1 1 1 1 1 1 1 1 1 1 1 1 1 1
symmnumber: 1
zpe: 845578.6 jmol-1
zpe.correction: 0.322064 hartree
zpe.thermalcorrener: 0.336303 hartree
zpe.thermalcorrenthalpy: 0.337247 hartree
zpe.thermalcorrgfe: 0.279233 hartree
zpe.sumelectzpe: -619.713401 hartree
zpe.sumelectthermal: -619.699162 hartree
zpe.sumelectthermalent: -619.698218 hartree
zpe.sumelectthermalfe: -619.756232 hartree
dipole: -0.0001 0.0001 -0.5915
dipole: 0.5915
quadrupole: -76.9362 -87.0329 -85.6972
quadrupole: -0.4980 -0.0001 -0.0001
quadrupole: 6.2859 -3.8108 -2.4751 -0.4980 -0.0001 -0.0001
hfenergy: -620.0354648 hartree
pointgroup: C01 [X(C12H22O2)]
dipole: 0.0000351 0.0001781 0.232704 debye
polarizability: 182.5909559|2.7223605|121.5458167|-0.0063115|-0.0062435|112.7038201 unknown
InChI: InChI=1S/C12H22O2/c1-3-7-11(8-4-1)13-14-12-9-5-2-6-10-12/h11-12H,1-10H2
charge 0 multiplicity 1
36 atoms
O  0.50326 0.593793 -0.069887
O  -0.503385 -0.594352 -0.068921
C  1.81426 -0.015057 0.217052
C  -1.814333 0.014931 0.217344
C  2.321565 -0.888761 -0.946455
C  2.747466 1.18587 0.48241
C  -2.321677 0.887127 -0.947283
C  -2.747574 -1.185604 0.484345
C  3.761571 -1.385746 -0.66614
C  4.189142 0.688654 0.76093
C  -3.761648 1.384533 -0.667554
C  -4.189217 -0.687956 0.762276
C  4.71856 -0.200272 -0.389964
C  -4.718653 0.199445 -0.389794
H  1.720169 -0.627206 1.139695
H  -1.720144 0.62828 1.139178
H  2.305029 -0.27844 -1.871528
H  1.630271 -1.736729 -1.098292
H  2.363508 1.775685 1.335058
H  2.744196 1.845076 -0.408203
H  -2.305233 0.275571 -1.871542
H  -1.630348 1.734854 -1.100294
H  -2.363597 -1.774291 1.337765
H  -2.744362 -1.845996 -0.405386
H  4.125623 -1.98448 -1.522865
H  3.754315 -2.062099 0.214125
H  4.200617 0.107726 1.706161
H  4.855445 1.559371 0.912952
H  -4.125721 1.982144 -1.525053
H  -3.754352 2.062037 0.211822
H  -4.200606 -0.105741 1.706716
H  -4.855548 -1.558435 0.915524
H  5.732018 -0.573638 -0.145898
H  4.812655 0.412822 -1.30999
H  -5.732101 0.573149 -0.146201
H  -4.812768 -0.414866 -1.309004
