program: Orca
programVersion: 5.0.2
elementType: Cl Cl O O O N C C C C C C C C C C C C C C C C C C C C C C H H H H H H H H H H H H H H H H H H H
charge: 0
multiplicity: 1
keywords: wb97x-d3
keywords: def2-TZVPP
keywords: def2/J RIJCOSX
keywords: DEFGRID2
keywords: scfconv7
keywords: smallprint printgap noloewdin
keywords: NOSOSCF
formula: C22H19Cl2NO3
InChI: InChI=1/C22H19Cl2NO3/c1-22(2)17(12-19(23)24)20(22)21(26)28-18(13-25)14-7-6-10-16(11-14)27-15-8-4-3-5-9-15/h3-12,17-18,20H,1-2H3
47 atoms
Cl 2.454291 -4.674201 1.920662
Cl 3.442393 -5.934686 -0.477536
O  -1.834563 -1.094235 -1.201481
O  -1.172326 -1.355277 0.917783
O  -0.931407 3.826871 -0.682224
N  -4.602956 -0.367936 -2.836973
C  1.609611 -1.047236 -0.635299
C  1.437495 -2.412352 -0.028524
C  0.335715 -1.833013 -0.887179
C  1.601152 0.140491 0.296573
C  2.515411 -0.852858 -1.826214
C  2.160144 -3.586295 -0.532389
C  -0.93218 -1.425275 -0.260822
C  2.619587 -4.585714 0.209441
C  -3.057707 -0.542531 -0.736531
C  -2.882961 0.82693 -0.119237
C  -3.909315 -0.454181 -1.923783
C  -1.974273 1.722773 -0.668483
C  -3.625689 1.171912 0.999205
C  -1.811434 2.966967 -0.081536
C  -3.462161 2.428676 1.565442
C  -2.555402 3.332016 1.035329
C  -0.096873 4.589398 0.100274
C  0.582098 4.049031 1.186025
C  0.089266 5.912941 -0.26975
C  1.448927 4.855675 1.909156
C  0.968431 6.704543 0.456409
C  1.646214 6.183109 1.550145
H  1.235073 -2.406998 1.036318
H  0.23634 -2.227201 -1.892376
H  1.024836 -0.025546 1.204363
H  1.198723 1.022103 -0.20701
H  2.623891 0.372325 0.598277
H  2.442685 -1.656575 -2.557355
H  3.555969 -0.781738 -1.505014
H  2.263274 0.076796 -2.338616
H  2.32345 -3.659473 -1.601144
H  -3.551926 -1.214759 -0.027027
H  -1.38628 1.465306 -1.541332
H  -4.323583 0.464616 1.428499
H  -4.042098 2.706759 2.435053
H  -2.43464 4.308511 1.48683
H  0.44507 3.011452 1.465992
H  -0.445644 6.317632 -1.119835
H  1.978003 4.43797 2.756021
H  1.115345 7.736956 0.167119
H  2.32594 6.805124 2.116887
elementType: Cl O N C H
totalener: -2050.67260234 hartree
nucrepener: 2743.83991697 hartree
electener: -4794.51251931 hartree
oneelecener: -8262.84829515 hartree
twoeener: 3468.33577584 hartree
cpcmener: -0.03801655 hartree
kineticenergy: 2044.44420263 hartree
xcener: -151.859680708465 hartree
chargesum: 0.0000000
charge: -0.057446 -0.062054 -0.280586 -0.451231 -0.342024 -0.100657 0.106206 0.024803 -0.064121 -0.277746 -0.269802 -0.202058 0.375379 0.038982 0.415812 0.015538 -0.221883 -0.246772 -0.194062 0.231542 -0.136535 -0.155145 0.273671 -0.171129 -0.238824 -0.173144 -0.132111 -0.175999 0.077687 0.103639 0.098927 0.093385 0.107436 0.094414 0.102786 0.099568 0.132804 0.149148 0.141440 0.148968 0.164053 0.161683 0.162542 0.148671 0.161715 0.161285 0.161242
qa: -0.0574 -0.0621 -0.2806 -0.4512 -0.3420 -0.1007 0.1062 0.0248 -0.0641 -0.2777 -0.2698 -0.2021 0.3754 0.0390 0.4158 0.0155 -0.2219 -0.2468 -0.1941 0.2315 -0.1365 -0.1551 0.2737 -0.1711 -0.2388 -0.1731 -0.1321 -0.1760 0.0777 0.1036 0.0989 0.0934 0.1074 0.0944 0.1028 0.0996 0.1328 0.1491 0.1414 0.1490 0.1641 0.1617 0.1625 0.1487 0.1617 0.1613 0.1612
va: 1.2683 1.2428 2.1222 2.0543 2.0458 3.1098 3.7453 3.8991 3.8123 3.9040 3.9041 3.8971 4.2178 4.2098 3.7044 3.6068 4.0851 4.0032 3.9794 3.7828 3.8996 3.9020 3.6682 3.8738 4.0055 3.9220 3.8852 3.8894 1.0489 1.0308 1.0134 0.9999 1.0020 1.0053 1.0006 1.0014 1.0177 1.0131 1.0245 1.0012 0.9889 0.9929 0.9918 1.0070 0.9904 0.9880 0.9890
dispcorr: -0.025257467 hartree
energy: -2050.697859803821
dipole: -1.84278 3.01219 1.16940 39.14594 -37.92219 1.22375 -0.68868 1.47405 0.78537
magnitude: 1.86598 au
magnitude: 4.74294 debye
