program: Orca
programVersion: 5.0.2
elementType: Cl Cl O O O N C C C C C C C C C C C C C C C C C C C C C C H H H H H H H H H H H H H H H H H H H
charge: 0
multiplicity: 1
keywords: wb97x-d3
keywords: def2-TZVPP
keywords: def2/J RIJCOSX
keywords: DEFGRID2
keywords: scfconv7
keywords: smallprint printgap noloewdin
keywords: NOSOSCF
formula: C22H19Cl2NO3
InChI: InChI=1/C22H19Cl2NO3/c1-22(2)17(12-19(23)24)20(22)21(26)28-18(13-25)14-7-6-10-16(11-14)27-15-8-4-3-5-9-15/h3-12,17-18,20H,1-2H3
47 atoms
Cl 3.688557 -1.01155 -1.950797
Cl 4.991303 -0.662769 0.599423
O  -2.211563 -1.315455 1.147956
O  -1.636561 -1.125661 -1.002422
O  -1.313431 3.60756 0.715087
N  -4.790473 -2.318586 -0.814426
C  0.571289 -3.183226 -0.055473
C  1.179924 -1.826486 -0.263652
C  -0.054556 -1.962133 0.598573
C  -0.096501 -3.849213 -1.231918
C  1.241192 -4.159158 0.880096
C  2.441662 -1.453006 0.394213
C  -1.337305 -1.424888 0.125484
C  3.551914 -1.098559 -0.237808
C  -3.4921 -0.786133 0.863787
C  -3.472525 0.670261 0.439505
C  -4.195162 -1.636616 -0.105215
C  -2.394174 1.466521 0.793811
C  -4.549267 1.220236 -0.246398
C  -2.372192 2.797186 0.400914
C  -4.530259 2.563219 -0.590381
C  -3.436129 3.358378 -0.286152
C  -0.034731 3.138605 0.527501
C  0.930707 3.574591 1.423149
C  0.303776 2.308067 -0.535311
C  2.250519 3.18234 1.247239
C  1.62608 1.920405 -0.693214
C  2.604156 2.351619 0.193406
H  1.014116 -1.401014 -1.247771
H  0.09414 -1.893217 1.670189
H  -0.940407 -4.458673 -0.904512
H  0.617856 -4.512351 -1.722841
H  -0.453272 -3.14606 -1.981186
H  1.643952 -3.685176 1.774251
H  2.061071 -4.668474 0.370717
H  0.528874 -4.919514 1.203243
H  2.476933 -1.47578 1.476985
H  -4.041423 -0.877164 1.805422
H  -1.562793 1.065745 1.36016
H  -5.404159 0.61428 -0.518488
H  -5.368686 2.990004 -1.123828
H  -3.406277 4.398918 -0.58141
H  0.651892 4.219677 2.24658
H  -0.443663 1.968332 -1.240797
H  3.002759 3.524998 1.945562
H  1.888878 1.280792 -1.525511
H  3.633282 2.045871 0.061472
elementType: Cl O N C H
totalener: -2050.67180744 hartree
nucrepener: 2915.99651118 hartree
electener: -4966.66831862 hartree
oneelecener: -8607.61555370 hartree
twoeener: 3640.94723509 hartree
cpcmener: -0.03804539 hartree
kineticenergy: 2044.45900771 hartree
xcener: -151.869189987414 hartree
chargesum: 0.0000000
charge: -0.058058 -0.059161 -0.290164 -0.452394 -0.341506 -0.098059 0.109070 -0.013363 -0.070273 -0.272996 -0.257869 -0.171800 0.391001 0.016482 0.508098 -0.021314 -0.245145 -0.230399 -0.213163 0.270596 -0.118243 -0.234076 0.301932 -0.256456 -0.203073 -0.120132 -0.157298 -0.174673 0.095395 0.101901 0.104375 0.100204 0.093838 0.091613 0.101664 0.100189 0.142348 0.154965 0.151644 0.138882 0.162394 0.150419 0.148032 0.152492 0.159990 0.160509 0.151581
qa: -0.0581 -0.0592 -0.2902 -0.4524 -0.3415 -0.0981 0.1091 -0.0134 -0.0703 -0.2730 -0.2579 -0.1718 0.3910 0.0165 0.5081 -0.0213 -0.2451 -0.2304 -0.2132 0.2706 -0.1182 -0.2341 0.3019 -0.2565 -0.2031 -0.1201 -0.1573 -0.1747 0.0954 0.1019 0.1044 0.1002 0.0938 0.0916 0.1017 0.1002 0.1423 0.1550 0.1516 0.1389 0.1624 0.1504 0.1480 0.1525 0.1600 0.1605 0.1516
va: 1.2651 1.2468 2.1370 2.0406 2.0697 3.1003 3.7858 3.8546 3.8595 3.9051 3.9035 3.8062 4.1512 4.1900 3.7543 3.7272 4.0970 3.9523 3.9660 3.7253 3.9037 4.0279 3.6627 4.0181 3.9093 3.9175 3.8453 3.8527 1.0309 1.0355 0.9996 1.0008 1.0170 1.0040 1.0011 1.0021 1.0108 0.9872 1.0118 1.0118 0.9885 1.0036 1.0071 1.0058 0.9881 0.9996 1.0063
dispcorr: -0.029219931 hartree
energy: -2050.701027371117
dipole: -15.31863 15.82836 0.50973 -6.26984 6.11699 -0.15285 4.65355 -2.51656 2.13699
magnitude: 2.20225 au
magnitude: 5.59768 debye
