program: Gaussian 09
title: 000074664
version: EM64L-G09RevD.01
frameworkgroup: C1[X(C28H20S)]
method: RPBEPBE
basis: SDD
operation: Freq
keyword: #pfreq=noraman
keyword: PBEPBE/SDD
title: #p freq=noraman PBEPBE/SDD
converged: YES YES NO NO
title: Mulliken charges:
elementType: S C C C C C C C C C C C C C C C C C C C C C C C C C C C C H H H H H H H H H H H H H H H H H H H H
charge: 0.247786 0.367328 0.367347 -0.572326 -0.572344 0.338116 0.338115 0.392803 0.392809 -0.394447 -0.394454 -0.394517 -0.394513 -0.374617 -0.374730 -0.375251 -0.375137 -0.231198 -0.231100 -0.231032 -0.231126 -0.227324 -0.227370 -0.227285 -0.227237 -0.245762 -0.245763 -0.239557 -0.239558 0.226519 0.226526 0.226570 0.226561 0.238185 0.238250 0.238555 0.238488 0.225178 0.225171 0.225163 0.225170 0.227481 0.227480 0.227468 0.227470 0.226878 0.226879 0.229175 0.229175
chargesum: 0.00000
title: Mulliken charges with hydrogens summed into heavy atoms:
elementType: S C C C C C C C C C C C C C C C C C C C C C C C C C C C C
charge: 0.247786 0.367328 0.367347 -0.572326 -0.572344 0.338116 0.338115 0.392803 0.392809 -0.167928 -0.167928 -0.167947 -0.167952 -0.136432 -0.136480 -0.136696 -0.136649 -0.006020 -0.005929 -0.005869 -0.005956 0.000158 0.000110 0.000183 0.000233 -0.018884 -0.018884 -0.010382 -0.010382
chargesum: -0.00033
polarizability: 3.78857028e+02 -2.02492834e-03 2.83336705e+02 1.15487081e-02 -1.84636032e-01 2.62746243e+02
1716.lowfreq: -50.9174 -50.6655 -41.9252 -38.6491 -8.8998 -7.0318 -3.9441 -1.2657 -0.1633
frequency: -50.8969 -50.6161 -41.8368 -38.6292 25.7183 34.1271 39.4508 40.7101 45.5470 87.2531 97.6620 114.1359 209.3503 212.0603 219.9532 224.9925 228.9689 234.5838 235.0683 324.4879 342.6207 398.0340 398.1445 399.2953 399.5033 416.6392 453.6471 478.2529 497.7939 511.6658 513.8259 581.1460 592.2215 606.7984 611.0589 617.5513 617.9382 633.2111 642.2958 648.4400 689.5288 700.5808 701.5287 704.1038 704.1403 736.5791 737.7440 761.0540 762.9313 798.3216 810.4942 838.0849 845.8511 848.6779 851.5053 853.4284 911.5480 920.7647 921.7584 926.8691 932.6416 965.9487 971.2610 972.9619 975.1874 975.8297 988.7812 988.9406 989.8918 990.6924 992.7125 993.2815 995.9534 995.9912 1024.5362 1026.1229 1027.9530 1032.2092 1075.3110 1075.9778 1076.2438 1076.5255 1102.4463 1171.1866 1171.3194 1171.8454 1171.9406 1182.4468 1184.3145 1184.4079 1185.9124 1187.7642 1231.5045 1305.7861 1306.8892 1308.9093 1309.4678 1309.9040 1365.2465 1367.7697 1367.9901 1369.1352 1369.1574 1428.0661 1428.8957 1429.7130 1429.8181 1458.7066 1468.1265 1485.5332 1486.7844 1538.8089 1572.1103 1581.2265 1581.9904 1584.2145 1584.4326 1611.2731 1612.3180 1617.6085 1617.6922 3119.3208 3119.9835 3122.7108 3123.5695 3123.6000 3124.6137 3130.0988 3130.1523 3136.0394 3137.3261 3142.4871 3142.5757 3145.1819 3146.2622 3151.0839 3151.1932 3162.2125 3162.6227 3165.2962 3165.4700
redmass: 4.1239 3.7594 3.6777 3.6951 5.4447 5.4407 5.4187 5.4988 5.5450 6.0369 5.0600 5.3160 5.9961 6.1467 5.0270 4.6149 4.2645 6.4769 4.7499 7.2359 8.6326 2.8111 2.8106 2.7957 2.8283 4.6523 7.1455 7.5276 3.9013 3.3830 3.4739 5.1686 7.5173 7.7034 6.4805 6.5427 6.5118 7.7906 6.6920 6.8666 4.8475 1.8748 1.5953 1.5158 1.7659 10.0025 2.1002 1.9164 1.8238 3.0964 3.7396 4.0518 1.2481 1.2463 1.2460 1.2434 2.6057 1.4468 1.4563 1.6280 2.1837 6.5853 1.3946 1.3899 1.3885 1.3857 6.2675 6.3478 6.1258 5.8191 1.3274 1.3340 1.3170 1.3192 2.5559 2.2290 2.0696 1.9391 1.5974 1.5881 1.5905 1.6046 3.4843 1.0531 1.0528 1.0540 1.0540 2.2270 1.3053 1.1613 1.1239 1.1157 4.5192 1.3802 1.3743 3.9469 1.3695 1.3771 4.9727 6.5461 6.5673 7.1191 6.8628 2.2177 2.2190 2.2102 2.2182 2.4028 2.2686 2.5731 2.6566 7.3837 8.9805 5.9455 5.9767 6.0422 6.0868 6.2828 6.3160 6.5462 6.7905 1.0844 1.0843 1.0877 1.0845 1.0845 1.0876 1.0877 1.0878 1.0922 1.0923 1.0926 1.0926 1.0967 1.0967 1.0970 1.0970 1.1016 1.1017 1.1018 1.1018
irintensity: 0.0000 0.0000 0.0000 0.0003 0.0000 0.4974 0.0164 0.2073 0.6589 0.0486 0.0000 0.1233 0.0952 0.3981 0.4901 0.3157 0.0588 0.0883 0.0000 0.1743 0.1007 0.0000 0.0308 0.0001 0.0090 0.8130 2.7197 0.0010 11.8085 1.2731 8.4013 31.0049 1.2022 24.5054 0.0002 0.0001 0.0527 0.6725 0.0404 5.8825 6.7103 102.9112 1.3779 75.9490 6.0109 0.2421 130.4685 37.7085 0.1170 12.6277 6.4197 20.9686 0.0002 0.7561 0.0001 0.1731 4.1323 0.0063 4.6621 1.0716 0.0113 7.0446 0.0001 0.1544 0.0003 0.1567 1.1873 4.2757 0.4191 1.0289 0.5797 0.0066 0.0272 0.0011 11.3543 21.2978 4.6395 0.0003 0.0173 8.0393 0.0385 30.6333 1.2590 0.0002 0.0069 0.0051 0.0055 4.6480 0.5842 1.8230 2.3540 0.0525 7.0489 0.0002 1.2904 1.9283 0.0016 1.9857 13.8740 0.0020 0.2124 0.0007 0.0143 0.0006 21.8680 0.0034 7.8123 3.1615 39.6761 0.0619 15.3499 10.6226 0.0274 0.0013 4.4338 2.7804 0.0005 4.7257 0.5127 6.4601 9.2322 2.5996 5.2063 0.0018 3.5529 0.8838 0.2877 0.0001 3.3646 9.4907 29.0886 41.9017 3.1981 0.0019 53.2721 0.1005 79.2838 12.5421 36.6524 48.3083 3.7103
temp: 298.150 k
press: 1.00000 atm
elementType: 16 6 6 6 6 6 6 6 6 6 6 6 6 6 6 6 6 6 6 6 6 6 6 6 6 6 6 6 6 1 1 1 1 1 1 1 1 1 1 1 1 1 1 1 1 1 1 1 1
symmnumber: 1
zpe: 1002166.0 jmol-1
zpe.correction: 0.381705 hartree
zpe.thermalcorrener: 0.402349 hartree
zpe.thermalcorrenthalpy: 0.403293 hartree
zpe.thermalcorrgfe: 0.330662 hartree
zpe.sumelectzpe: -1475.092486 hartree
zpe.sumelectthermal: -1475.071842 hartree
zpe.sumelectthermalent: -1475.070898 hartree
zpe.sumelectthermalfe: -1475.143529 hartree
dipole: -0.0001 0.9776 0.0007
dipole: 0.9776
quadrupole: -156.5071 -173.9468 -154.6528
quadrupole: -0.0001 0.0060 -0.0520
quadrupole: 5.1951 -12.2445 7.0494 -0.0001 0.0060 -0.0520
hfenergy: -1475.4741904 hartree
pointgroup: C01 [X(C28H20S1)]
dipole: -0.0004058 -0.3846112 -0.0000364 debye
polarizability: 378.8569382|-0.0924875|283.3365441|-0.0132431|-0.1981133|262.746494 unknown
InChI: InChI=1S/C28H20S/c1-5-13-21(14-6-1)25-26(22-15-7-2-8-16-22)28(24-19-11-4-12-20-24)29-27(25)23-17-9-3-10-18-23/h1-20H
charge 0 multiplicity 1
49 atoms
S  0.002441 2.546198 -0.001139
C  -0.73091 -0.002341 -0.000089
C  0.730719 -0.003804 -0.000017
C  -1.288696 1.271486 -0.000653
C  1.291048 1.268904 -0.000532
C  -1.551713 -1.253609 0.000029
C  1.548993 -1.256708 0.000495
C  -2.71757 1.679821 -0.000677
C  2.720731 1.674408 -0.000767
C  -1.939452 -1.863472 1.22058
C  1.941355 -1.864114 -1.2198
C  -1.947899 -1.858058 -1.220498
C  1.937995 -1.865282 1.221291
C  -3.413173 1.876256 1.221955
C  3.415978 1.871526 -1.223493
C  -3.409352 1.890192 -1.223157
C  3.41369 1.881301 1.22164
C  -2.708395 -3.048418 1.221952
C  2.707791 -3.050692 -1.220646
C  -2.716914 -3.042967 -1.221797
C  2.704459 -3.051833 1.223119
C  -4.770348 2.26689 1.222155
C  4.773935 2.259437 -1.223871
C  -4.766513 2.280888 -1.223149
C  4.771647 2.269228 1.221454
C  -3.099899 -3.642516 0.000093
C  3.092081 -3.648923 0.001483
C  -5.451175 2.470746 -0.000439
C  5.455933 2.459811 -0.001353
H  -1.638103 -1.404073 2.169214
H  1.645508 -1.401566 -2.168631
H  -1.653145 -1.394426 -2.169138
H  1.639704 -1.403536 2.169752
H  -2.883992 1.719865 2.168583
H  2.885907 1.717841 -2.170069
H  -2.877205 1.74466 -2.169854
H  2.881839 1.735183 2.168413
H  -3.001616 -3.506192 2.173516
H  3.004651 -3.506528 -2.172011
H  -3.016783 -3.496491 -2.173325
H  2.998742 -3.508542 2.174867
H  -5.294922 2.411857 2.173237
H  5.298211 2.404972 -2.175031
H  -5.288119 2.43672 -2.174148
H  5.294153 2.422368 2.172395
H  -3.697034 -4.561457 0.000122
H  3.687248 -4.569139 0.001867
H  -6.503914 2.77504 -0.000356
H  6.509282 2.761986 -0.001571
