program: Gaussian 09
title: 000074474
version: EM64L-G09RevD.01
frameworkgroup: C1[X(C11H12ClNO2)]
method: RPBEPBE
basis: SDD
operation: Freq
keyword: #p
keyword: freq=noraman
keyword: PBEPBE/SDD
title: #p freq=noraman PBEPBE/SDD
converged: YES YES NO NO
title: Mulliken charges:
elementType: Cl O O N C C C C C C C C C C C H H H H H H H H H H H H
charge: -0.065736 -0.331957 -0.286633 -0.156731 -0.445795 -0.445253 -0.351712 -0.356020 0.271432 0.383192 -0.298171 -0.392606 -0.194184 -0.182380 -0.116869 0.233158 0.226491 0.234073 0.226591 0.232480 0.247226 0.234486 0.256095 0.312727 0.255434 0.254734 0.255930
chargesum: 0.00000
title: Mulliken charges with hydrogens summed into heavy atoms:
elementType: Cl O O N C C C C C C C C C C C
charge: -0.065736 -0.331957 -0.286633 -0.156731 0.013854 0.015411 0.127994 0.134561 0.271432 0.383192 0.014555 -0.137173 0.060550 0.073549 -0.116869
polarizability: 2.24472064e+02 1.30445398e+00 1.31969929e+02 4.58104035e-01 -1.15882828e-01 7.12507946e+01
1716.lowfreq: -11.6946 -8.0219 -0.0011 0.0018 0.0020 2.7713 13.4287 30.1896 67.3128
frequency: 11.1148 30.1292 67.2939 76.5764 104.6832 140.9691 174.3556 221.8182 235.8166 240.7742 294.8632 324.2957 343.5961 412.6724 416.3929 496.7534 501.6123 567.1834 616.5376 639.9900 677.6539 696.3324 700.9677 756.9916 804.3698 815.6222 834.5747 853.3323 864.2489 911.0039 920.4580 944.5985 966.8376 968.5430 993.9943 1001.8692 1060.6681 1070.2326 1104.8103 1118.3579 1153.1633 1160.4878 1164.9749 1181.5472 1199.8584 1218.9404 1243.5089 1285.0848 1303.5616 1313.2998 1322.7002 1340.9231 1356.9603 1368.4473 1398.0183 1466.5465 1468.8213 1473.8600 1490.9080 1498.1447 1583.4157 1598.9708 1666.4706 2988.7409 2992.9883 3012.2322 3014.0783 3068.2368 3069.3511 3083.4127 3096.6419 3159.2795 3166.2379 3179.4688 3208.2123
redmass: 4.1636 5.1763 3.4026 5.0173 4.5157 8.1584 7.3716 2.6042 3.9928 2.3322 6.1550 7.5076 6.0330 3.0417 8.6689 2.9141 6.0799 1.8636 7.1002 7.2281 10.6271 3.8965 4.1772 5.2115 3.1757 1.3140 1.4308 2.0351 1.9327 2.5570 1.3552 1.3371 2.0941 1.3241 4.3172 3.7101 1.9805 2.3227 1.2943 1.6078 2.1342 1.5278 1.4361 1.8755 2.5065 1.2950 1.3322 1.2597 1.3480 1.2306 1.7812 1.4987 3.5037 6.9585 3.7059 2.3742 1.0879 1.0950 1.0797 1.0893 7.5272 6.9040 11.2151 1.0653 1.0660 1.0653 1.0622 1.0990 1.0973 1.1011 1.1056 1.0885 1.0916 1.0975 1.0947
irintensity: 1.2749 0.0379 0.3370 0.5984 2.1670 0.6568 0.3972 3.5755 1.0415 0.7475 16.8020 1.2750 2.6878 0.0627 5.4899 23.5940 15.8828 4.9567 5.9520 8.1124 18.1602 1.1945 3.3513 33.7427 0.2118 15.9033 73.9978 34.3945 3.7755 19.3267 0.4989 1.2592 56.4281 1.8734 42.6805 157.4214 58.7803 27.0856 17.5230 17.7659 180.9192 70.3240 1.3024 20.0450 306.9926 15.3754 5.3374 3.7982 2.1816 13.9555 165.2749 10.8640 350.0894 4.9135 15.7363 262.9164 9.4811 8.8338 3.8145 4.8176 5.5320 7.1103 399.7120 57.6635 11.5528 29.5907 28.8852 30.9937 3.2435 26.8926 61.3783 3.8686 2.7972 3.0117 9.4335
temp: 298.150 k
press: 1.00000 atm
elementType: 17 8 8 7 6 6 6 6 6 6 6 6 6 6 6 1 1 1 1 1 1 1 1 1 1 1 1
symmnumber: 1
zpe: 551959.3 jmol-1
zpe.correction: 0.210230 hartree
zpe.thermalcorrener: 0.224088 hartree
zpe.thermalcorrenthalpy: 0.225033 hartree
zpe.thermalcorrgfe: 0.166572 hartree
zpe.sumelectzpe: -1090.534686 hartree
zpe.sumelectthermal: -1090.520828 hartree
zpe.sumelectthermalent: -1090.519884 hartree
zpe.sumelectthermalfe: -1090.578345 hartree
dipole: -5.1957 -2.5119 0.1673
dipole: 5.7735
quadrupole: -86.1787 -91.8312 -96.3266
quadrupole: 3.5515 -0.3275 0.5488
quadrupole: 5.2668 -0.3857 -4.8811 3.5515 -0.3275 0.5488
hfenergy: -1090.7449163 hartree
pointgroup: C01 [X(C11H12Cl1N1O2)]
dipole: -2.0815873 -0.8328136 -0.3645812 debye
polarizability: 224.4058749|-2.9899221|120.1545133|0.8775273|24.0704806|83.1323987 unknown
InChI: InChI=1S/C11H12ClNO2/c12-9-3-5-10(6-4-9)15-11(14)13-7-1-2-8-13/h3-6H,1-2,7-8H2
charge 0 multiplicity 1
27 atoms
Cl 5.723319 -0.272646 0.027239
O  -0.31165 -0.2966 -0.103086
O  -0.900908 1.829465 0.82488
N  -2.500078 0.277576 0.121186
C  -4.424127 -0.879164 -0.659035
C  -4.844747 0.117781 0.453695
C  -2.897146 -1.035343 -0.454421
C  -3.665387 1.11634 0.506488
C  -1.224465 0.717962 0.330748
C  1.101704 -0.173942 -0.023431
C  1.811552 0.912376 0.543589
C  1.787946 -1.283026 -0.572088
C  3.225055 0.872273 0.553843
C  3.197072 -1.318685 -0.559612
C  3.897522 -0.234962 0.006306
H  -4.950601 -1.845801 -0.592692
H  -4.62986 -0.444505 -1.654441
H  -5.803275 0.619271 0.240738
H  -4.93896 -0.408432 1.421191
H  -2.658817 -1.850943 0.255102
H  -2.350333 -1.233086 -1.391216
H  -3.795005 1.944672 -0.217124
H  -3.502754 1.562121 1.502229
H  1.274651 1.764956 0.959814
H  1.211322 -2.106796 -1.002404
H  3.788958 1.70305 0.987832
H  3.735213 -2.17191 -0.981831
