program: Orca
programVersion: 5.0.2
elementType: Cl Cl O O O N C C C C C C C C C C C C C C C C C C C C C C H H H H H H H H H H H H H H H H H H H
charge: 0
multiplicity: 1
keywords: wb97x-d3
keywords: def2-TZVPP
keywords: def2/J RIJCOSX
keywords: DEFGRID2
keywords: scfconv7
keywords: smallprint printgap noloewdin
keywords: NOSOSCF
formula: C22H19Cl2NO3
InChI: InChI=1/C22H19Cl2NO3/c1-22(2)17(12-19(23)24)20(22)21(26)28-18(13-25)14-7-6-10-16(11-14)27-15-8-4-3-5-9-15/h3-12,17-18,20H,1-2H3
47 atoms
Cl 2.225532 -5.304948 0.199116
Cl 3.967024 -4.691729 -2.016288
O  -1.410019 -0.311609 -1.192996
O  -1.426718 -1.461734 0.726742
O  -1.692908 4.338935 0.819288
N  -3.679936 0.326772 -3.50179
C  1.647026 -0.92171 0.69637
C  1.432878 -2.258044 0.049542
C  0.639128 -1.052019 -0.427785
C  1.196856 -0.763485 2.12853
C  2.879689 -0.11468 0.368436
C  2.413726 -2.837727 -0.875262
C  -0.810703 -0.992683 -0.195766
C  2.807045 -4.104495 -0.887602
C  -2.799547 -0.073696 -1.073346
C  -3.119767 1.133758 -0.217639
C  -3.273837 0.152207 -2.440055
C  -2.195863 2.15886 -0.071914
C  -4.377822 1.223333 0.363474
C  -2.543087 3.275254 0.678302
C  -4.713777 2.354856 1.090475
C  -3.798368 3.382462 1.258555
C  -0.357107 4.112951 1.055769
C  0.555221 4.885611 0.352977
C  0.069036 3.19323 2.005847
C  1.91151 4.74085 0.611633
C  1.427983 3.056461 2.250053
C  2.353595 3.825319 1.556336
H  0.872279 -2.964136 0.651877
H  0.956651 -0.627724 -1.372932
H  0.458127 -1.501322 2.431359
H  0.779711 0.22923 2.30308
H  2.059353 -0.878772 2.786962
H  3.146124 -0.150271 -0.686748
H  3.734098 -0.472853 0.9450
H  2.719234 0.932858 0.628549
H  2.857635 -2.18272 -1.615476
H  -3.327908 -0.952855 -0.689798
H  -1.221109 2.101303 -0.53991
H  -5.09015 0.416458 0.246134
H  -5.69224 2.432871 1.544491
H  -4.054508 4.262347 1.834213
H  0.207056 5.596776 -0.385126
H  -0.645628 2.596005 2.558487
H  2.623637 5.344301 0.064304
H  1.762874 2.344396 2.992811
H  3.411046 3.712635 1.754407
elementType: Cl O N C H
totalener: -2050.67212554 hartree
nucrepener: 2788.61024220 hartree
electener: -4839.28236774 hartree
oneelecener: -8351.94285980 hartree
twoeener: 3512.66049206 hartree
cpcmener: -0.03714402 hartree
kineticenergy: 2044.45725641 hartree
xcener: -151.863695845983 hartree
chargesum: -0.0000000
charge: -0.056392 -0.060017 -0.293578 -0.464275 -0.343075 -0.100074 0.116527 0.016983 -0.071133 -0.283748 -0.262502 -0.197816 0.400633 0.033869 0.410769 0.028015 -0.224057 -0.143573 -0.221651 0.210485 -0.118471 -0.224363 0.259859 -0.237758 -0.155068 -0.125641 -0.196019 -0.171525 0.085947 0.097979 0.101571 0.092363 0.105228 0.094292 0.102156 0.091456 0.134467 0.147936 0.149949 0.150093 0.162368 0.151841 0.149033 0.160715 0.160874 0.172551 0.162778
qa: -0.0564 -0.0600 -0.2936 -0.4643 -0.3431 -0.1001 0.1165 0.0170 -0.0711 -0.2837 -0.2625 -0.1978 0.4006 0.0339 0.4108 0.0280 -0.2241 -0.1436 -0.2217 0.2105 -0.1185 -0.2244 0.2599 -0.2378 -0.1551 -0.1256 -0.1960 -0.1715 0.0859 0.0980 0.1016 0.0924 0.1052 0.0943 0.1022 0.0915 0.1345 0.1479 0.1499 0.1501 0.1624 0.1518 0.1490 0.1607 0.1609 0.1726 0.1628
va: 1.2696 1.2453 2.1109 2.0429 2.0580 3.1133 3.6702 3.9220 3.8619 3.8986 3.9100 3.8925 4.1451 4.2115 3.7053 3.6432 4.0745 3.9073 3.9867 3.7754 3.8904 4.0069 3.7030 4.0027 3.8528 3.8884 3.8571 3.8525 1.0420 1.0353 1.0210 1.0038 1.0000 1.0066 1.0015 1.0074 1.0163 1.0207 1.0159 1.0005 0.9878 1.0033 1.0064 0.9964 0.9876 0.9814 0.9894
dispcorr: -0.026249467 hartree
energy: -2050.698375006970
dipole: -3.08259 4.25978 1.17718 32.28412 -31.40753 0.87659 16.65996 -15.15693 1.50303
magnitude: 2.10078 au
magnitude: 5.33976 debye
