program: Orca
programVersion: 5.0.2
elementType: Cl Cl O O O N C C C C C C C C C C C C C C C C C C C C C C H H H H H H H H H H H H H H H H H H H
charge: 0
multiplicity: 1
keywords: wb97x-d3
keywords: def2-TZVPP
keywords: def2/J RIJCOSX
keywords: DEFGRID2
keywords: scfconv7
keywords: smallprint printgap noloewdin
keywords: NOSOSCF
formula: C22H19Cl2NO3
InChI: InChI=1/C22H19Cl2NO3/c1-22(2)17(12-19(23)24)20(22)21(26)28-18(13-25)14-7-6-10-16(11-14)27-15-8-4-3-5-9-15/h3-12,17-18,20H,1-2H3
47 atoms
Cl 2.731513 0.28542 -0.078314
Cl 4.555462 -0.911373 1.802856
O  -1.678445 -1.65208 -0.264969
O  -2.295522 -2.221833 1.801464
O  -0.781977 3.344355 0.512738
N  -3.242719 -0.90064 -3.061845
C  0.525948 -3.726412 -0.017192
C  1.065377 -2.360962 0.278606
C  -0.150454 -2.875901 1.041791
C  -0.10257 -3.962682 -1.369937
C  1.241949 -4.950541 0.503427
C  2.316841 -2.149064 1.01533
C  -1.470494 -2.23672 0.920572
C  3.087565 -1.073366 0.913703
C  -2.915346 -0.995606 -0.469466
C  -2.939667 0.411064 0.084313
C  -3.08376 -0.950728 -1.923949
C  -1.791418 1.193484 0.046804
C  -4.13608 0.920766 0.56631
C  -1.863431 2.510305 0.480132
C  -4.186028 2.234881 1.008386
C  -3.057589 3.035485 0.959772
C  0.230337 3.248718 -0.410617
C  1.511544 3.519685 0.047418
C  0.000234 2.967318 -1.751887
C  2.573574 3.503135 -0.844782
C  1.075215 2.937822 -2.629039
C  2.363497 3.202853 -2.183468
H  0.843248 -1.617195 -0.477216
H  0.036809 -3.19856 2.059374
H  -0.931891 -4.667995 -1.295741
H  0.643445 -4.402838 -2.033913
H  -0.464365 -3.057163 -1.849954
H  2.095901 -5.191911 -0.131737
H  0.567047 -5.807565 0.491222
H  1.602365 -4.838465 1.52501
H  2.644311 -2.921664 1.700249
H  -3.749857 -1.576111 -0.063049
H  -0.857088 0.783121 -0.31627
H  -5.021095 0.298317 0.595085
H  -5.113087 2.642365 1.388157
H  -3.095844 4.063388 1.296656
H  1.67519 3.74135 1.094316
H  -0.99921 2.773779 -2.119997
H  3.571885 3.713305 -0.484259
H  0.897538 2.711775 -3.672249
H  3.195326 3.177911 -2.874515
elementType: Cl O N C H
totalener: -2050.66991133 hartree
nucrepener: 2902.61421519 hartree
electener: -4953.28412652 hartree
oneelecener: -8580.62325531 hartree
twoeener: 3627.33912879 hartree
cpcmener: -0.03724245 hartree
kineticenergy: 2044.45896971 hartree
xcener: -151.866388365407 hartree
chargesum: 0.0000000
charge: -0.054722 -0.065225 -0.280287 -0.466235 -0.332823 -0.101066 0.104970 0.023405 -0.076639 -0.265124 -0.283352 -0.206226 0.417666 0.051927 0.386753 0.031332 -0.223976 -0.209469 -0.225175 0.304178 -0.104899 -0.249824 0.330830 -0.259154 -0.218606 -0.157994 -0.136516 -0.172181 0.089244 0.098797 0.103320 0.097477 0.090456 0.103276 0.099929 0.095760 0.129968 0.147914 0.136357 0.148727 0.161772 0.150135 0.144495 0.159321 0.158022 0.162495 0.160970
qa: -0.0547 -0.0652 -0.2803 -0.4662 -0.3328 -0.1011 0.1050 0.0234 -0.0766 -0.2651 -0.2834 -0.2062 0.4177 0.0519 0.3868 0.0313 -0.2240 -0.2095 -0.2252 0.3042 -0.1049 -0.2498 0.3308 -0.2592 -0.2186 -0.1580 -0.1365 -0.1722 0.0892 0.0988 0.1033 0.0975 0.0905 0.1033 0.0999 0.0958 0.1300 0.1479 0.1364 0.1487 0.1618 0.1501 0.1445 0.1593 0.1580 0.1625 0.1610
va: 1.2955 1.2416 2.1187 2.0392 2.0823 3.1047 3.7322 3.8616 3.8373 3.9102 3.9211 3.8842 4.1627 4.2098 3.7310 3.6417 4.0705 3.9708 3.9904 3.6965 3.8817 3.9989 3.6191 3.9560 3.9095 3.8380 3.8731 3.8510 1.0296 1.0277 0.9999 1.0001 1.0097 0.9994 1.0002 1.0052 1.0214 1.0196 1.0095 1.0010 0.9880 1.0055 1.0098 0.9965 0.9927 0.9886 0.9887
dispcorr: -0.027107016 hartree
energy: -2050.697018342425
dipole: -12.82534 13.19582 0.37048 -11.57874 10.52291 -1.05583 -7.18636 7.60846 0.42210
magnitude: 1.19591 au
magnitude: 3.03976 debye
