program: Gaussian 09
title: 000074520
version: EM64L-G09RevD.01
frameworkgroup: C1[X(C15H17ClN2O)]
method: RPBEPBE
basis: SDD
operation: Freq
keyword: #p
keyword: freq=noraman
keyword: PBEPBE/SDD
title: #p freq=noraman PBEPBE/SDD
converged: YES YES NO NO
title: Mulliken charges:
elementType: Cl O N N C C C C C C C C C C C C C C C H H H H H H H H H H H H H H H H H
charge: -0.069132 -0.229178 -0.329607 -0.011609 -0.202656 -0.445174 -0.432269 -0.412181 -0.400009 -0.389992 0.361374 0.256117 -0.552813 -0.026173 -0.289974 -0.026271 -0.306065 -0.194449 -0.235238 0.237468 0.163197 0.240843 0.229269 0.200560 0.214867 0.206141 0.202184 0.212715 0.212894 0.193471 0.321212 0.254881 0.266218 0.253166 0.267519 0.258693
chargesum: 0.00000
title: Mulliken charges with hydrogens summed into heavy atoms:
elementType: Cl O N N C C C C C C C C C C C C C C C
charge: -0.069132 -0.229178 -0.008395 -0.011609 0.034812 -0.041134 -0.002439 0.008826 0.014891 0.016372 0.361374 0.256117 -0.031714 -0.026173 -0.036808 -0.026271 -0.038546 -0.194449 0.023456
polarizability: 2.33758655e+02 1.23974549e+01 2.59572931e+02 8.35850880e+00 -2.54473300e+00 1.14268752e+02
1716.lowfreq: -13.5366 -1.3202 0.0017 0.0018 0.0019 7.6730 30.1827 53.5978 65.9879
frequency: 29.1090 53.5878 65.9407 67.4951 118.6957 137.1953 164.6473 183.1616 215.8295 221.2138 232.9502 291.9789 304.3459 315.0513 328.7035 374.7133 405.2819 410.6352 427.3995 454.4355 463.5805 488.4646 510.4274 529.7452 553.1207 624.3796 641.7715 673.0988 685.5731 702.2713 745.0688 764.9466 783.1026 783.9417 809.2439 829.6579 843.1236 857.6118 866.5214 886.8485 892.7423 918.4038 955.3480 973.7407 979.3258 1015.7089 1045.8109 1052.8250 1070.8156 1073.3674 1083.6168 1110.8850 1133.1525 1137.1111 1138.3709 1175.9146 1216.4061 1237.0509 1240.7790 1254.3623 1261.4935 1269.8360 1282.7038 1301.1704 1317.3873 1322.7070 1329.9979 1337.3523 1341.2043 1345.9046 1353.3209 1368.8873 1423.4274 1447.4106 1457.2096 1460.6412 1461.6243 1466.5422 1467.9097 1474.2774 1513.4690 1516.4780 1552.6280 1607.1843 1617.5592 2936.8416 2968.7757 2971.6263 2972.6620 2976.3491 3013.9552 3022.1686 3033.4498 3036.9922 3038.7661 3041.6063 3050.8082 3128.4602 3157.2543 3166.7705 3179.0516 3510.8840
redmass: 3.7057 4.2095 7.5688 4.1488 7.3586 3.5348 5.3323 4.3172 4.6859 2.1981 3.2482 4.1567 8.4777 4.6079 2.1547 4.1258 4.4413 3.6009 3.1420 3.4524 4.5681 1.5981 3.5596 3.6078 5.3598 6.0684 2.9105 3.1895 2.1130 5.4300 3.0258 3.5502 1.7533 2.5137 4.6695 1.7177 2.5671 1.6719 2.7363 1.7871 1.8550 1.9559 2.1550 1.3322 2.3063 2.4557 1.8848 1.6743 2.6879 1.5062 2.2036 2.3484 4.9926 1.6392 2.1515 1.4054 1.5142 1.3143 1.5306 1.5342 1.3395 1.3827 1.3567 1.2529 1.5347 1.3238 2.2193 1.4131 1.4854 1.4879 1.5095 1.8755 3.5333 2.0590 1.0922 1.0873 1.0902 1.3783 1.1812 1.0957 2.3268 4.4838 5.0589 7.3757 8.6908 1.0666 1.0661 1.0655 1.0593 1.0622 1.0839 1.0622 1.0947 1.0963 1.0983 1.0998 1.1029 1.1040 1.0878 1.0911 1.0984 1.0764
irintensity: 0.6173 0.1379 6.0586 0.0505 4.3972 2.7637 2.8072 0.1612 0.1868 1.0851 1.8183 0.8409 0.5013 2.8373 0.3093 10.6873 1.6461 4.6745 1.5945 3.0624 15.2726 4.3321 3.9881 6.3672 7.8805 14.0545 21.0512 46.2881 33.1946 15.8993 12.5091 13.7900 5.0958 11.9438 34.6604 49.2409 2.4962 6.3855 16.8665 9.6908 3.5491 1.4742 5.2702 1.3847 20.1225 2.8494 5.7086 1.7436 3.6026 8.6329 29.9979 0.0450 38.1593 7.2135 4.7893 10.8936 5.3132 7.6554 11.2471 11.3883 4.2203 3.4920 19.9132 2.0519 1.7424 0.7680 3.8993 0.8309 2.6792 20.5234 3.1103 11.5140 35.8020 159.6683 6.9703 2.8894 11.3803 94.8321 23.5605 3.5857 26.8899 139.2441 40.7928 213.4746 553.3156 28.7577 31.5518 19.6211 29.0540 24.4562 10.9354 25.8343 63.7147 63.0456 1.2607 6.9356 96.8278 6.3693 0.3131 3.6813 5.7933 75.3229
temp: 298.150 k
press: 1.00000 atm
elementType: 17 8 7 7 6 6 6 6 6 6 6 6 6 6 6 6 6 6 6 1 1 1 1 1 1 1 1 1 1 1 1 1 1 1 1 1
symmnumber: 1
zpe: 765941.1 jmol-1
zpe.correction: 0.291732 hartree
zpe.thermalcorrener: 0.308375 hartree
zpe.thermalcorrenthalpy: 0.309319 hartree
zpe.thermalcorrgfe: 0.246835 hartree
zpe.sumelectzpe: -1225.178499 hartree
zpe.sumelectthermal: -1225.161855 hartree
zpe.sumelectthermalent: -1225.160911 hartree
zpe.sumelectthermalfe: -1225.223395 hartree
dipole: 6.2315 -3.7663 2.7269
dipole: 7.7751
quadrupole: -108.0568 -150.9122 -119.6492
quadrupole: 7.4677 -2.5690 11.1472
quadrupole: 18.1493 -24.7062 6.5568 7.4677 -2.5690 11.1472
hfenergy: -1225.4702301 hartree
pointgroup: C01 [X(C15H17Cl1N2O1)]
dipole: -2.7253565 -0.8285474 -1.1149539 debye
polarizability: 230.6509876|-7.3616809|258.6584429|2.709961|25.6783373|118.2909072 unknown
InChI: InChI=1S/C15H17ClN2O/c16-11-6-7-13-12(8-11)15(17-9-14(19)18-13)10-4-2-1-3-5-10/h6-8,10,17H,1-5,9H2
charge 0 multiplicity 1
36 atoms
Cl 1.848046 -4.215209 -0.790454
O  1.66532 3.831228 1.031194
N  -0.48941 1.801546 -0.377989
N  2.398002 1.642561 0.522126
C  -1.75893 -0.220713 0.149093
C  -2.696505 0.591767 1.092061
C  -2.513413 -0.561306 -1.17671
C  -3.986349 -0.208969 1.39215
C  -3.816554 -1.343912 -0.889778
C  -4.73707 -0.580817 0.091429
C  -0.422504 0.466231 -0.126187
C  0.824703 -0.247939 -0.16316
C  0.614078 2.633372 -0.846748
C  2.140678 0.388503 0.064019
C  0.779273 -1.67881 -0.378077
C  1.632324 2.759436 0.355849
C  3.311066 -0.457314 -0.082308
C  1.943089 -2.419305 -0.470303
C  3.233466 -1.818711 -0.338816
H  -1.542972 -1.16967 0.673728
H  -3.002495 1.549576 0.615317
H  -2.168373 0.843717 2.030961
H  -1.857717 -1.143426 -1.851683
H  -2.752973 0.384866 -1.70424
H  -4.642635 0.381073 2.059314
H  -3.719689 -1.134068 1.942704
H  -3.560334 -2.333357 -0.458235
H  -4.347935 -1.540307 -1.840408
H  -5.629086 -1.190609 0.32928
H  -5.104523 0.345976 -0.395963
H  -1.361802 2.279805 -0.136024
H  0.23422 3.628503 -1.118429
H  1.101583 2.149996 -1.711598
H  -0.181882 -2.180416 -0.515819
H  4.276617 0.03559 0.06428
H  4.136087 -2.430287 -0.426375
