program: Orca
programVersion: 5.0.2
elementType: Cl Cl O O O N C C C C C C C C C C C C C C C C C C C C C C H H H H H H H H H H H H H H H H H H H
charge: 0
multiplicity: 1
keywords: wb97x-d3
keywords: def2-TZVPP
keywords: def2/J RIJCOSX
keywords: DEFGRID2
keywords: scfconv7
keywords: smallprint printgap noloewdin
keywords: NOSOSCF
formula: C22H19Cl2NO3
InChI: InChI=1/C22H19Cl2NO3/c1-22(2)17(12-19(23)24)20(22)21(26)28-18(13-25)14-7-6-10-16(11-14)27-15-8-4-3-5-9-15/h3-12,17-18,20H,1-2H3
47 atoms
Cl 0.813487 -3.669812 -2.232536
Cl 3.553911 -4.574524 -2.275024
O  -1.020304 -0.422733 -1.021734
O  -1.413143 -1.590809 0.842629
O  -1.520179 4.149791 1.161363
N  -2.825945 0.594734 -3.589776
C  1.675532 -1.306076 1.296006
C  1.433645 -2.593554 0.589764
C  0.829768 -1.323816 0.029098
C  1.043225 -1.089779 2.648401
C  3.016429 -0.630532 1.14346
C  2.494999 -3.278622 -0.180286
C  -0.627922 -1.15507 0.038187
C  2.311426 -3.775936 -1.394653
C  -2.402023 -0.118964 -1.111288
C  -2.814259 1.004784 -0.186335
C  -2.618346 0.278944 -2.503364
C  -1.930853 2.043423 0.074474
C  -4.093548 1.009642 0.352002
C  -2.338983 3.084257 0.896727
C  -4.492726 2.07124 1.150777
C  -3.618378 3.108976 1.433762
C  -0.190368 3.914718 1.427291
C  0.203123 2.949305 2.345614
C  0.745482 4.714163 0.789247
C  1.553082 2.793191 2.624329
C  2.092924 4.549891 1.082028
C  2.502505 3.589125 1.995899
H  0.723571 -3.260897 1.072448
H  1.319837 -0.912596 -0.845417
H  0.742321 -0.04959 2.780498
H  1.772609 -1.322014 3.426047
H  0.174506 -1.720084 2.821226
H  3.729991 -1.032899 1.864471
H  2.925554 0.441053 1.328904
H  3.439091 -0.757813 0.146494
H  3.470752 -3.397937 0.276844
H  -3.020449 -1.003552 -0.927439
H  -0.938796 2.04984 -0.360316
H  -4.773617 0.192985 0.146515
H  -5.48849 2.083209 1.572906
H  -3.923352 3.931593 2.067627
H  -0.530772 2.330278 2.846799
H  0.423104 5.460536 0.074493
H  1.86171 2.045692 3.343427
H  2.824023 5.174659 0.585996
H  3.552942 3.462282 2.220974
elementType: Cl O N C H
totalener: -2050.67009093 hartree
nucrepener: 2849.43882596 hartree
electener: -4900.10891690 hartree
oneelecener: -8474.17661002 hartree
twoeener: 3574.06769312 hartree
cpcmener: -0.03671774 hartree
kineticenergy: 2044.46857966 hartree
xcener: -151.864120175084 hartree
chargesum: -0.0000000
charge: -0.051482 -0.056227 -0.288433 -0.466010 -0.344232 -0.100615 0.149297 -0.027132 -0.137803 -0.281822 -0.278249 -0.220852 0.403932 0.077325 0.424867 0.008801 -0.225562 -0.140127 -0.210459 0.200990 -0.120877 -0.219925 0.255113 -0.153542 -0.234938 -0.193911 -0.129731 -0.169504 0.116318 0.117578 0.089705 0.103384 0.099635 0.103937 0.092549 0.096600 0.143112 0.147030 0.148683 0.149643 0.162193 0.152398 0.161555 0.149278 0.173615 0.161368 0.162529
qa: -0.0515 -0.0562 -0.2884 -0.4660 -0.3442 -0.1006 0.1493 -0.0271 -0.1378 -0.2818 -0.2782 -0.2209 0.4039 0.0773 0.4249 0.0088 -0.2256 -0.1401 -0.2105 0.2010 -0.1209 -0.2199 0.2551 -0.1535 -0.2349 -0.1939 -0.1297 -0.1695 0.1163 0.1176 0.0897 0.1034 0.0996 0.1039 0.0925 0.0966 0.1431 0.1470 0.1487 0.1496 0.1622 0.1524 0.1616 0.1493 0.1736 0.1614 0.1625
va: 1.2807 1.2502 2.1035 2.0395 2.0557 3.1125 3.6764 3.8886 3.8483 3.8868 3.9216 3.9157 4.1077 4.1805 3.6967 3.6334 4.0830 3.8967 3.9814 3.7794 3.8942 4.0036 3.7105 3.8590 4.0011 3.8655 3.8888 3.8702 1.0190 1.0235 1.0048 1.0012 1.0208 0.9999 1.0085 1.0001 1.0077 1.0193 1.0177 1.0009 0.9879 1.0030 0.9958 1.0060 0.9797 0.9875 0.9894
dispcorr: -0.027356578 hartree
energy: -2050.697447510965
dipole: 1.92429 -0.52164 1.40266 23.88208 -23.94333 -0.06125 28.79675 -26.42853 2.36821
magnitude: 2.75311 au
magnitude: 6.99785 debye
