program: Orca
programVersion: 5.0.2
elementType: Cl Cl O O O N C C C C C C C C C C C C C C C C C C C C C C H H H H H H H H H H H H H H H H H H H
charge: 0
multiplicity: 1
keywords: wb97x-d3
keywords: def2-TZVPP
keywords: def2/J RIJCOSX
keywords: DEFGRID2
keywords: scfconv7
keywords: smallprint printgap noloewdin
keywords: NOSOSCF
formula: C22H19Cl2NO3
InChI: InChI=1/C22H19Cl2NO3/c1-22(2)17(12-19(23)24)20(22)21(26)28-18(13-25)14-7-6-10-16(11-14)27-15-8-4-3-5-9-15/h3-12,17-18,20H,1-2H3
47 atoms
Cl 3.35617 -5.07348 1.149074
Cl 2.236871 -7.299794 -0.301679
O  -1.564506 -1.266495 -0.134542
O  0.444933 -0.916377 0.778386
O  -0.556408 4.337434 1.453166
N  -4.678618 -0.3423 0.460729
C  1.337524 -2.408611 -1.857317
C  1.479509 -3.311285 -0.66671
C  0.164777 -2.596866 -0.910637
C  2.118575 -1.117542 -1.857465
C  1.165683 -2.994188 -3.237304
C  1.508932 -4.772851 -0.795721
C  -0.251911 -1.524279 0.00539
C  2.262227 -5.593069 -0.074394
C  -2.076183 -0.179369 0.621881
C  -1.627642 1.163231 0.089618
C  -3.531179 -0.288522 0.514234
C  -1.293662 2.163495 0.988091
C  -1.587035 1.39803 -1.279524
C  -0.9104 3.410739 0.513392
C  -1.184197 2.642794 -1.737214
C  -0.841034 3.654534 -0.852036
C  -0.767544 5.675336 1.215925
C  0.255315 6.548952 1.552304
C  -1.976875 6.149365 0.722519
C  0.064454 7.914601 1.392253
C  -2.148273 7.515787 0.555365
C  -1.132828 8.403275 0.888386
H  2.073878 -2.898991 0.140525
H  -0.647968 -3.195195 -1.305814
H  1.555413 -0.324097 -2.352255
H  3.047297 -1.257789 -2.412425
H  2.385667 -0.77511 -0.860583
H  0.727849 -2.250924 -3.905223
H  0.518209 -3.869741 -3.255163
H  2.133761 -3.281518 -3.651036
H  0.860542 -5.230268 -1.533485
H  -1.816332 -0.275266 1.681509
H  -1.327808 1.977614 2.054989
H  -1.859624 0.625743 -1.986923
H  -1.134083 2.832958 -2.800825
H  -0.521712 4.616215 -1.231807
H  1.189429 6.164209 1.941391
H  -2.779726 5.467389 0.471967
H  0.862067 8.595695 1.658175
H  -3.088027 7.886659 0.16762
H  -1.275772 9.467553 0.757829
elementType: Cl O N C H
totalener: -2050.67278693 hartree
nucrepener: 2649.69550319 hartree
electener: -4700.36829012 hartree
oneelecener: -8074.84517689 hartree
twoeener: 3374.47688677 hartree
cpcmener: -0.03793309 hartree
kineticenergy: 2044.45543316 hartree
xcener: -151.862012747148 hartree
chargesum: 0.0000000
charge: -0.057253 -0.061128 -0.283286 -0.460602 -0.336362 -0.100902 0.091033 0.030328 -0.064252 -0.266125 -0.269499 -0.203343 0.386138 0.040608 0.419711 0.027622 -0.220561 -0.245800 -0.230284 0.276134 -0.142794 -0.173820 0.277144 -0.244547 -0.188694 -0.127773 -0.147718 -0.183252 0.079665 0.101762 0.098631 0.101249 0.095353 0.099808 0.093830 0.102277 0.133917 0.145702 0.137804 0.150409 0.163736 0.159596 0.148505 0.161167 0.161765 0.162296 0.161802
qa: -0.0573 -0.0611 -0.2833 -0.4606 -0.3364 -0.1009 0.0910 0.0303 -0.0643 -0.2661 -0.2695 -0.2033 0.3861 0.0406 0.4197 0.0276 -0.2206 -0.2458 -0.2303 0.2761 -0.1428 -0.1738 0.2771 -0.2445 -0.1887 -0.1278 -0.1477 -0.1833 0.0797 0.1018 0.0986 0.1012 0.0954 0.0998 0.0938 0.1023 0.1339 0.1457 0.1378 0.1504 0.1637 0.1596 0.1485 0.1612 0.1618 0.1623 0.1618
va: 1.2683 1.2440 2.1237 2.0473 2.0647 3.1110 3.7334 3.8841 3.8271 3.9035 3.9085 3.8993 4.1954 4.2094 3.6969 3.6131 4.0857 4.0900 3.9553 3.7436 3.9117 3.9054 3.6756 4.0056 3.9105 3.8794 3.8845 3.8944 1.0479 1.0319 1.0001 1.0011 1.0162 1.0008 1.0052 1.0004 1.0174 1.0174 1.0177 1.0122 0.9897 0.9948 1.0069 0.9949 0.9879 0.9893 0.9891
dispcorr: -0.023291932 hartree
energy: -2050.696078857409
dipole: -6.67725 7.43845 0.76121 39.48230 -38.44561 1.03669 -16.61738 14.74244 -1.87494
magnitude: 2.27367 au
magnitude: 5.77921 debye
