program: Orca
programVersion: 5.0.2
elementType: Cl Cl O O O N C C C C C C C C C C C C C C C C C C C C C C H H H H H H H H H H H H H H H H H H H
charge: 0
multiplicity: 1
keywords: wb97x-d3
keywords: def2-TZVPP
keywords: def2/J RIJCOSX
keywords: DEFGRID2
keywords: scfconv7
keywords: smallprint printgap noloewdin
keywords: NOSOSCF
formula: C22H19Cl2NO3
InChI: InChI=1/C22H19Cl2NO3/c1-22(2)17(12-19(23)24)20(22)21(26)28-18(13-25)14-7-6-10-16(11-14)27-15-8-4-3-5-9-15/h3-12,17-18,20H,1-2H3
47 atoms
Cl 3.002943 -0.977011 -2.078432
Cl 4.803679 -0.461931 0.114636
O  -1.687975 -1.450558 -0.218943
O  -2.160226 -1.667216 1.950513
O  -1.188495 3.576351 0.46052
N  -3.319049 -0.92244 -3.033089
C  0.604093 -3.452939 0.598172
C  1.072179 -2.102643 0.128166
C  0.028289 -2.195758 1.219066
C  -0.219415 -4.282226 -0.355342
C  1.495156 -4.281967 1.489805
C  2.398406 -1.577079 0.480014
C  -1.369218 -1.75934 1.044425
C  3.27437 -1.079735 -0.383222
C  -2.986474 -0.921492 -0.440849
C  -3.133619 0.490731 0.081647
C  -3.156312 -0.934311 -1.894667
C  -2.053858 1.363442 -0.000022
C  -4.345359 0.899494 0.612341
C  -2.195905 2.65737 0.479635
C  -4.476574 2.206067 1.067102
C  -3.410549 3.085253 1.009287
C  0.061144 3.174062 0.031381
C  0.945541 2.613009 0.939151
C  0.413797 3.362537 -1.294658
C  2.21034 2.239064 0.506384
C  1.681872 2.985302 -1.715433
C  2.580485 2.42307 -0.819217
H  0.707004 -1.819885 -0.851839
H  0.373283 -2.00498 2.229501
H  -0.923805 -4.911623 0.191253
H  0.436364 -4.941731 -0.925844
H  -0.782121 -3.686858 -1.071586
H  0.904704 -5.028342 2.023303
H  2.022471 -3.686935 2.234296
H  2.239598 -4.812264 0.893574
H  2.689356 -1.588628 1.523748
H  -3.760879 -1.566351 -0.012854
H  -1.116675 1.030608 -0.427181
H  -5.17657 0.209173 0.675563
H  -5.417441 2.539337 1.483827
H  -3.511239 4.098872 1.375806
H  0.650783 2.472231 1.971146
H  -0.293676 3.798176 -1.988501
H  2.907346 1.804543 1.210477
H  1.965381 3.130303 -2.749191
H  3.567217 2.131904 -1.15308
elementType: Cl O N C H
totalener: -2050.67129871 hartree
nucrepener: 2928.90525813 hartree
electener: -4979.57655684 hartree
oneelecener: -8633.10192910 hartree
twoeener: 3653.52537225 hartree
cpcmener: -0.03802358 hartree
kineticenergy: 2044.46376169 hartree
xcener: -151.865848602352 hartree
chargesum: -0.0000000
charge: -0.057973 -0.061620 -0.277426 -0.457793 -0.338375 -0.099238 0.092861 0.072868 -0.109811 -0.267770 -0.267450 -0.228604 0.419268 0.042043 0.382630 -0.005540 -0.222970 -0.193001 -0.233361 0.296235 -0.099676 -0.245218 0.233922 -0.171882 -0.172369 -0.160366 -0.166289 -0.135079 0.087585 0.103689 0.103126 0.097997 0.094779 0.099666 0.092286 0.101363 0.138597 0.150288 0.135599 0.147642 0.161257 0.149327 0.154760 0.151682 0.152466 0.160915 0.148961
qa: -0.0580 -0.0616 -0.2774 -0.4578 -0.3384 -0.0992 0.0929 0.0729 -0.1098 -0.2678 -0.2674 -0.2286 0.4193 0.0420 0.3826 -0.0055 -0.2230 -0.1930 -0.2334 0.2962 -0.0997 -0.2452 0.2339 -0.1719 -0.1724 -0.1604 -0.1663 -0.1351 0.0876 0.1037 0.1031 0.0980 0.0948 0.0997 0.0923 0.1014 0.1386 0.1503 0.1356 0.1476 0.1613 0.1493 0.1548 0.1517 0.1525 0.1609 0.1490
va: 1.2644 1.2433 2.1218 2.0465 2.0795 3.1072 3.7574 3.7833 3.8930 3.9121 3.9083 3.8577 4.1322 4.1887 3.7399 3.6806 4.0775 3.9120 3.9968 3.7282 3.8878 4.0026 3.7128 3.9795 3.9639 3.8248 3.9412 3.7949 1.0383 1.0293 0.9997 1.0005 1.0109 1.0017 1.0044 1.0008 1.0137 1.0147 1.0274 1.0017 0.9875 1.0067 0.9994 1.0005 0.9986 0.9903 1.0098
dispcorr: -0.028861993 hartree
energy: -2050.700160704869
dipole: -13.66608 14.23937 0.57329 -9.72156 8.72426 -0.99730 10.22118 -8.85800 1.36318
magnitude: 1.78368 au
magnitude: 4.53376 debye
