program: Orca
programVersion: 5.0.2
elementType: Cl Cl O O O N C C C C C C C C C C C C C C C C C C C C C C H H H H H H H H H H H H H H H H H H H
charge: 0
multiplicity: 1
keywords: wb97x-d3
keywords: def2-TZVPP
keywords: def2/J RIJCOSX
keywords: DEFGRID2
keywords: scfconv7
keywords: smallprint printgap noloewdin
keywords: NOSOSCF
formula: C22H19Cl2NO3
InChI: InChI=1/C22H19Cl2NO3/c1-22(2)17(12-19(23)24)20(22)21(26)28-18(13-25)14-7-6-10-16(11-14)27-15-8-4-3-5-9-15/h3-12,17-18,20H,1-2H3
47 atoms
Cl 2.966264 -0.935535 -2.097248
Cl 4.812211 -0.493065 0.073423
O  -1.68131 -1.460039 -0.22344
O  -2.14308 -1.667678 1.949211
O  -1.204233 3.581399 0.397246
N  -3.334542 -0.949981 -3.029851
C  0.601976 -3.472614 0.594089
C  1.079181 -2.129422 0.113252
C  0.039212 -2.206839 1.209595
C  -0.230509 -4.299777 -0.353414
C  1.487015 -4.30454 1.488948
C  2.411992 -1.614346 0.453468
C  -1.35722 -1.765307 1.039151
C  3.271188 -1.0914 -0.411714
C  -2.983062 -0.935123 -0.440235
C  -3.130119 0.476535 0.082737
C  -3.163176 -0.957287 -1.892506
C  -2.063458 1.3610 -0.037543
C  -4.324667 0.870472 0.661544
C  -2.199623 2.650662 0.454664
C  -4.451791 2.173704 1.126771
C  -3.396943 3.063316 1.033533
C  0.052114 3.181232 -0.013306
C  0.90848 2.572282 0.891501
C  0.441555 3.426894 -1.319273
C  2.181322 2.207986 0.475524
C  1.718568 3.060361 -1.722836
C  2.588427 2.449565 -0.830323
H  0.711113 -1.849999 -0.866498
H  0.389717 -2.012584 2.217412
H  0.419803 -4.961991 -0.926986
H  -0.794731 -3.702928 -1.067135
H  -0.934303 -4.925968 0.197519
H  2.225931 -4.845392 0.895377
H  0.889852 -5.042047 2.027254
H  2.020239 -3.710455 2.229913
H  2.724827 -1.658368 1.489915
H  -3.752461 -1.581424 -0.005431
H  -1.14052 1.040263 -0.503493
H  -5.145119 0.170787 0.754952
H  -5.378813 2.494963 1.582208
H  -3.492657 4.073467 1.410744
H  0.58618 2.388229 1.90857
H  -0.243618 3.900713 -2.010503
H  2.856796 1.737169 1.177462
H  2.030901 3.251337 -2.740813
H  3.581807 2.166116 -1.150762
elementType: Cl O N C H
totalener: -2050.67142900 hartree
nucrepener: 2927.40843084 hartree
electener: -4978.07985984 hartree
oneelecener: -8630.12152634 hartree
twoeener: 3652.04166649 hartree
cpcmener: -0.03811375 hartree
kineticenergy: 2044.46077686 hartree
xcener: -151.865216850072 hartree
chargesum: 0.0000000
charge: -0.058396 -0.061939 -0.276866 -0.458170 -0.338529 -0.099534 0.090877 0.073611 -0.109099 -0.266777 -0.268430 -0.228410 0.420728 0.043913 0.383818 -0.002150 -0.222283 -0.193394 -0.230774 0.289589 -0.101550 -0.243640 0.236125 -0.173766 -0.178956 -0.153984 -0.162361 -0.143049 0.086322 0.103727 0.098178 0.094567 0.102784 0.101298 0.099538 0.092471 0.137758 0.149789 0.137043 0.147776 0.161597 0.149658 0.155998 0.151083 0.153758 0.160978 0.149073
qa: -0.0584 -0.0619 -0.2769 -0.4582 -0.3385 -0.0995 0.0909 0.0736 -0.1091 -0.2668 -0.2684 -0.2284 0.4207 0.0439 0.3838 -0.0021 -0.2223 -0.1934 -0.2308 0.2896 -0.1016 -0.2436 0.2361 -0.1738 -0.1790 -0.1540 -0.1624 -0.1430 0.0863 0.1037 0.0982 0.0946 0.1028 0.1013 0.0995 0.0925 0.1378 0.1498 0.1370 0.1478 0.1616 0.1497 0.1560 0.1511 0.1538 0.1610 0.1491
va: 1.2635 1.2424 2.1240 2.0463 2.0774 3.1069 3.7600 3.7873 3.8883 3.9117 3.9089 3.8648 4.1343 4.1867 3.7406 3.6735 4.0786 3.9100 3.9933 3.7325 3.8897 4.0010 3.7097 3.9774 3.9735 3.8204 3.9373 3.8004 1.0390 1.0291 1.0004 1.0110 0.9999 1.0007 1.0016 1.0046 1.0146 1.0148 1.0264 1.0018 0.9875 1.0064 0.9988 1.0013 0.9973 0.9898 1.0091
dispcorr: -0.028807059 hartree
energy: -2050.700236058861
dipole: -13.54929 14.13641 0.58712 -9.85926 8.84194 -1.01732 10.48430 -9.08589 1.39841
magnitude: 1.82625 au
magnitude: 4.64197 debye
