program: Orca
programVersion: 5.0.2
elementType: Cl Cl O O O N C C C C C C C C C C C C C C C C C C C C C C H H H H H H H H H H H H H H H H H H H
charge: 0
multiplicity: 1
keywords: wb97x-d3
keywords: def2-TZVPP
keywords: def2/J RIJCOSX
keywords: DEFGRID2
keywords: scfconv7
keywords: smallprint printgap noloewdin
keywords: NOSOSCF
formula: C22H19Cl2NO3
InChI: InChI=1/C22H19Cl2NO3/c1-22(2)17(12-19(23)24)20(22)21(26)28-18(13-25)14-7-6-10-16(11-14)27-15-8-4-3-5-9-15/h3-12,17-18,20H,1-2H3
47 atoms
Cl 4.365372 -4.042599 -1.059877
Cl 3.343093 -6.629629 -0.302566
O  -0.883897 -1.024216 0.856654
O  0.902203 -0.358029 -0.310346
O  -1.492144 4.784217 -0.537515
N  -2.554274 0.085143 3.478397
C  0.128152 -2.901756 -2.010736
C  1.335457 -3.187491 -1.166613
C  0.091466 -2.606326 -0.522368
C  0.223904 -1.777895 -3.012783
C  -0.757976 -4.03019 -2.47763
C  1.728436 -4.554419 -0.805297
C  0.120334 -1.226322 -0.015465
C  2.974758 -5.004478 -0.738432
C  -1.020666 0.290102 1.371494
C  -1.65788 1.243843 0.385271
C  -1.877378 0.153628 2.550701
C  -1.249035 2.568644 0.38652
C  -2.657982 0.808113 -0.47566
C  -1.868395 3.470628 -0.469488
C  -3.241389 1.715602 -1.346368
C  -2.860041 3.048838 -1.342458
C  -1.20025 5.477819 0.612295
C  -0.184432 6.419898 0.535112
C  -1.918966 5.301819 1.788279
C  0.116544 7.190708 1.649006
C  -1.597354 6.071195 2.897465
C  -0.581781 7.016067 2.835728
H  2.148987 -2.482609 -1.295276
H  -0.515006 -3.28903 0.061424
H  0.967253 -1.028208 -2.752658
H  -0.739619 -1.277961 -3.12686
H  0.499723 -2.186007 -3.986204
H  -0.330231 -4.508098 -3.360491
H  -1.739311 -3.641834 -2.753778
H  -0.912829 -4.797868 -1.720992
H  0.942696 -5.261158 -0.566826
H  -0.059204 0.687111 1.713791
H  -0.455815 2.88824 1.05184
H  -2.984154 -0.223472 -0.474744
H  -4.015745 1.386522 -2.02597
H  -3.327746 3.75801 -2.013242
H  0.361472 6.551402 -0.390426
H  -2.722766 4.579129 1.848398
H  0.907659 7.926255 1.58598
H  -2.153879 5.931881 3.814857
H  -0.33914 7.612998 3.704498
elementType: Cl O N C H
totalener: -2050.67288466 hartree
nucrepener: 2669.44430733 hartree
electener: -4720.11719198 hartree
oneelecener: -8114.19774436 hartree
twoeener: 3394.08055237 hartree
cpcmener: -0.03760896 hartree
kineticenergy: 2044.45246626 hartree
xcener: -151.861662146391 hartree
chargesum: -0.0000000
charge: -0.057050 -0.060865 -0.284513 -0.461684 -0.338515 -0.101262 0.094416 0.028362 -0.069891 -0.266864 -0.267218 -0.201307 0.391722 0.040055 0.416896 0.024255 -0.221636 -0.194514 -0.216749 0.261646 -0.132037 -0.218303 0.290182 -0.255463 -0.192330 -0.122055 -0.147308 -0.191153 0.079915 0.100667 0.094639 0.099104 0.100960 0.101840 0.099323 0.093481 0.133366 0.144788 0.148695 0.150157 0.161919 0.151978 0.148900 0.157954 0.161249 0.162798 0.161447
qa: -0.0570 -0.0609 -0.2845 -0.4617 -0.3385 -0.1013 0.0944 0.0284 -0.0699 -0.2669 -0.2672 -0.2013 0.3917 0.0401 0.4169 0.0243 -0.2216 -0.1945 -0.2167 0.2616 -0.1320 -0.2183 0.2902 -0.2555 -0.1923 -0.1221 -0.1473 -0.1912 0.0799 0.1007 0.0946 0.0991 0.1010 0.1018 0.0993 0.0935 0.1334 0.1448 0.1487 0.1502 0.1619 0.1520 0.1489 0.1580 0.1612 0.1628 0.1614
va: 1.2686 1.2440 2.1209 2.0460 2.0669 3.1110 3.7322 3.8885 3.8359 3.9041 3.9085 3.8981 4.1841 4.2087 3.7048 3.6082 4.0813 3.9848 3.9420 3.7284 3.9099 4.0025 3.6776 4.0051 3.8998 3.8773 3.8880 3.9022 1.0476 1.0325 1.0170 1.0002 1.0011 1.0005 1.0009 1.0053 1.0174 1.0199 1.0040 1.0118 0.9885 1.0032 1.0075 0.9970 0.9880 0.9892 0.9894
dispcorr: -0.023346107 hartree
energy: -2050.696230763113
dipole: -24.23706 23.49692 -0.74014 26.36142 -26.53635 -0.17493 -8.08087 6.80209 -1.27879
magnitude: 1.48785 au
magnitude: 3.78182 debye
