program: Gaussian 09
title: 000074451
version: EM64L-G09RevD.01
frameworkgroup: C1[X(C4H12N6)]
method: RPBEPBE
basis: SDD
operation: Freq
keyword: #pfreq=noraman
keyword: PBEPBE/SDD
title: #p freq=noraman PBEPBE/SDD
converged: NO YES NO NO
title: Mulliken charges:
elementType: N N N N N N C C C C H H H H H H H H H H H H
charge: -0.063152 -0.063150 -0.304781 -0.284249 -0.304778 -0.284261 -0.357573 -0.402577 -0.357580 -0.402573 0.223293 0.202007 0.213648 0.222490 0.223295 0.202005 0.213644 0.222495 0.269675 0.281220 0.269674 0.281229
chargesum: 0.00000
title: Mulliken charges with hydrogens summed into heavy atoms:
elementType: N N N N N N C C C C
charge: -0.063152 -0.063150 -0.035106 -0.003029 -0.035105 -0.003032 0.067727 0.033561 0.067719 0.033567
polarizability: 9.80961108e+01 1.19518678e-04 9.35087961e+01 -2.63472211e-05 -6.30047735e-01 6.37070422e+01
1716.lowfreq: -24.6615 -2.7332 -0.0005 -0.0001 0.0002 16.2918 132.9163 142.9090 268.3428
frequency: 132.9051 142.9076 268.3425 303.1058 332.5867 333.0018 386.7268 414.1284 420.7136 499.9548 527.2738 570.0102 641.9259 650.9651 654.0970 704.7688 730.7357 854.4642 906.5969 933.8499 935.6696 966.8403 1003.4579 1041.3859 1051.1365 1079.1775 1079.2070 1088.0764 1119.7984 1141.8049 1144.9225 1148.4197 1244.4811 1253.7516 1273.3288 1305.7039 1331.8673 1331.9732 1371.7809 1377.0713 1418.9549 1421.4686 1428.0113 1428.4652 1434.8080 1436.8852 1437.6329 1492.7003 2848.5209 2853.1317 2925.6740 2927.8499 3049.4647 3050.3308 3055.4373 3056.4262 3350.5813 3357.0652 3449.7556 3466.4181
redmass: 2.9333 3.8139 1.9654 3.6343 2.4164 2.2601 1.8479 6.6898 5.4188 2.4908 3.7232 2.8741 1.2224 2.7321 3.3896 2.7055 3.5838 2.5770 1.7856 1.7200 3.5364 2.4575 6.4500 2.1194 2.4239 3.2385 2.3765 3.3801 4.2157 2.5241 2.2805 2.1451 1.2023 1.1771 1.2421 1.2809 1.1024 1.2032 1.2064 1.3283 1.1236 1.1264 1.1178 1.1705 1.1360 1.1858 1.1405 1.0721 1.0678 1.0676 1.0658 1.0662 1.0919 1.0923 1.0940 1.0938 1.0748 1.0743 1.0747 1.0764
irintensity: 4.9087 0.1951 1.9267 2.6273 58.4525 16.0134 2.4610 8.3841 0.8146 1.6260 0.1240 38.8364 41.7711 227.6811 148.9774 18.9374 29.7025 42.7148 38.3967 13.5213 24.4409 19.9250 106.1520 8.8946 1.3329 22.1158 17.9036 50.7096 0.5683 4.5141 28.3708 18.6417 1.3462 7.8361 5.1046 7.1132 18.8820 1.3610 3.2629 6.3360 7.0193 0.4163 23.5201 0.9070 3.8122 5.2569 0.3987 3.4234 196.6665 1.4022 169.0258 5.1191 3.4517 0.2993 93.6897 0.0977 1.7373 3.6224 0.0928 0.2923
temp: 298.150 k
press: 1.00000 atm
elementType: 7 7 7 7 7 7 6 6 6 6 1 1 1 1 1 1 1 1 1 1 1 1
symmnumber: 1
zpe: 493988.9 jmol-1
zpe.correction: 0.188150 hartree
zpe.thermalcorrener: 0.196737 hartree
zpe.thermalcorrenthalpy: 0.197682 hartree
zpe.thermalcorrgfe: 0.155301 hartree
zpe.sumelectzpe: -487.160837 hartree
zpe.sumelectthermal: -487.152250 hartree
zpe.sumelectthermalent: -487.151306 hartree
zpe.sumelectthermalfe: -487.193686 hartree
dipole: 2.0864 -0.0001 0.0001
dipole: 2.0864
quadrupole: -62.3241 -51.7945 -64.5614
quadrupole: 0.0004 -0.0001 -1.0031
quadrupole: -2.7641 7.7655 -5.0014 0.0004 -0.0001 -1.0031
hfenergy: -487.3489879 hartree
pointgroup: C01 [X(C4H12N6)]
dipole: 0.8208672 -0.0004951 -0.0001377 debye
dipolederiv: -0.7791922 0.0313479 -0.007085 -0.0124541 -0.2686721 0.0917281 0.0349136 0.0321859 -0.3599059 -0.7792329 -0.0306937 0.0072925 0.0131386 -0.2686357 0.091707 -0.0348083 0.0322162 -0.3598844 -0.3948226 0.0034189 0.1550384 -0.0479749 -0.1565125 -0.0018896 0.2811238 -0.0961611 -0.3008007 -0.6484403 -0.1102547 0.0824309 -0.1681456 -0.1435777 0.0517489 0.2502505 0.1817574 -0.0716853 -0.3948515 -0.0031373 -0.1550177 0.0482766 -0.1565643 -0.0017061 -0.2812266 -0.0958024 -0.3007018 -0.6483395 0.110932 -0.0822529 0.1687919 -0.144032 0.0518269 -0.249887 0.1820687 -0.0716668 0.6663225 -0.0173982 -0.0080809 -0.080634 0.2610172 -0.0323993 0.0191976 -0.0815247 0.4714461 0.8184811 0.1541523 -0.0630112 0.0883053 0.2591316 -0.0672865 -0.0505265 -0.1794004 0.4281722 0.6664247 0.016858 0.008007 0.0801057 0.2608852 -0.0324219 -0.0193422 -0.0814986 0.4714345 0.8183498 -0.1548692 0.0628315 -0.0889997 0.2594378 -0.0673263 0.0502344 -0.1794211 0.4281376 0.0449058 -0.0271897 -0.0067295 0.012569 -0.1298284 -0.0460366 0.0077899 -0.0735015 0.0551978 -0.0824858 -0.0164312 0.049522 0.0087264 0.0600965 0.0034409 -0.0213561 0.1675154 -0.2603574 -0.0493234 0.0019554 -0.0282889 -0.0156086 0.0753278 -0.0144575 0.0539998 0.1159658 -0.2069041 0.0413723 0.0449909 0.0043954 -0.0187259 -0.1452561 -0.0485741 0.0180334 -0.0935376 0.0536122 0.0449245 0.0269542 0.0066698 -0.0128004 -0.129843 -0.0460409 -0.0078836 -0.0734948 0.0551999 -0.0824805 0.0166526 -0.0495645 -0.0085418 0.0600874 0.003505 0.0215233 0.1674839 -0.2603519 -0.0493069 -0.0017795 0.0282452 0.0157514 0.0753311 -0.0145406 -0.0538862 0.1159987 -0.2069073 0.0413234 -0.0452572 -0.0044545 0.0184712 -0.1452428 -0.0485602 -0.0181536 -0.093481 0.0536481 0.0464176 0.0332572 -0.0789307 0.0462082 0.0761186 0.0334692 -0.2361554 0.0715413 0.1988597 0.3369209 0.1127423 0.0562215 0.1286749 0.1120967 0.0301722 -0.0951039 -0.0450303 -0.0076875 0.0463763 -0.0332074 0.0790049 -0.046167 0.0762157 0.033379 0.2362827 0.0712511 0.1987923 0.3366566 -0.1130435 -0.0562436 -0.1289675 0.1124192 0.0302626 0.0949802 -0.0451309 -0.0076473 unknown
polarizability: 98.0961083|-0.0031214|93.4925375|-0.0043382|-0.9387709|63.7233034 unknown
InChI: InChI=1S/C4H12N6/c1-5-6-3-10-4-8-7-2-9(1)10/h5-8H,1-4H2
charge 0 multiplicity 1
22 atoms
N  0.024775 -0.688955 -0.333737
N  0.025722 0.689167 0.334257
N  2.453093 -0.673738 -0.35473
N  -2.445646 -0.70535 -0.164893
N  2.454011 0.670856 0.354691
N  -2.444674 0.708659 0.165961
C  1.248552 -1.387832 0.148121
C  -1.196619 -1.384765 0.207735
C  1.250277 1.386486 -0.1479
C  -1.194938 1.386473 -0.207004
H  1.247418 -2.403962 -0.285271
H  1.246305 -1.436625 1.267253
H  -1.150242 -1.42863 1.319226
H  -1.211759 -2.409133 -0.206341
H  1.250514 2.402611 0.285503
H  1.247822 1.43528 -1.267031
H  -1.148694 1.430127 -1.318511
H  -1.208693 2.410927 0.2069
H  3.286012 -1.169139 0.014653
H  -2.679188 -0.809254 -1.160898
H  3.287472 1.165211 -0.014869
H  -2.677922 0.812884 1.161986
