program: Orca
programVersion: 5.0.2
elementType: Cl Cl O O O N C C C C C C C C C C C C C C C C C C C C C C H H H H H H H H H H H H H H H H H H H
charge: 0
multiplicity: 1
keywords: wb97x-d3
keywords: def2-TZVPP
keywords: def2/J RIJCOSX
keywords: DEFGRID2
keywords: scfconv7
keywords: smallprint printgap noloewdin
keywords: NOSOSCF
formula: C22H19Cl2NO3
InChI: InChI=1/C22H19Cl2NO3/c1-22(2)17(12-19(23)24)20(22)21(26)28-18(13-25)14-7-6-10-16(11-14)27-15-8-4-3-5-9-15/h3-12,17-18,20H,1-2H3
47 atoms
Cl 0.841935 -6.124498 -1.183581
Cl 3.575594 -5.7421 -2.020222
O  -0.40521 -0.022954 -0.960171
O  -1.480571 -1.771687 -0.077913
O  -1.352592 4.08766 2.182113
N  -1.227709 2.18995 -3.270061
C  1.311562 -2.342811 1.222406
C  1.106352 -3.230254 0.031586
C  0.913936 -1.729137 -0.107396
C  0.318103 -2.441105 2.354257
C  2.710777 -2.032183 1.697699
C  2.225311 -3.862544 -0.675864
C  -0.446071 -1.221704 -0.35461
C  2.206119 -5.074258 -1.216964
C  -1.659131 0.584421 -1.255013
C  -2.217852 1.329349 -0.067281
C  -1.398922 1.488332 -2.377318
C  -1.496223 2.383511 0.482533
C  -3.431605 0.940266 0.480104
C  -2.014877 3.06198 1.575929
C  -3.929067 1.618451 1.58415
C  -3.230968 2.68135 2.131425
C  -0.613964 4.965198 1.431371
C  0.636433 5.322056 1.913412
C  -1.114999 5.529062 0.263976
C  1.391835 6.257488 1.219617
C  -0.343581 6.452736 -0.425303
C  0.909327 6.821778 0.047133
H  0.182982 -3.797647 0.050073
H  1.701482 -1.18443 -0.615478
H  0.168604 -1.468334 2.826674
H  0.706183 -3.11956 3.116023
H  -0.65324 -2.821192 2.047648
H  3.108278 -2.864134 2.282104
H  2.699953 -1.151568 2.342168
H  3.408555 -1.829158 0.886161
H  3.146827 -3.301403 -0.774459
H  -2.381868 -0.15938 -1.605512
H  -0.541504 2.672915 0.058069
H  -3.985695 0.116103 0.050115
H  -4.874116 1.321206 2.018958
H  -3.622161 3.217198 2.987107
H  1.011809 4.875194 2.825751
H  -2.096216 5.25874 -0.106592
H  2.366551 6.53815 1.597773
H  -0.732238 6.892047 -1.335138
H  1.503526 7.545868 -0.494535
elementType: Cl O N C H
totalener: -2050.68701899 hartree
nucrepener: 2695.23265362 hartree
electener: -4745.91967261 hartree
oneelecener: -8165.95822896 hartree
twoeener: 3420.03855635 hartree
cpcmener: -0.03048947 hartree
kineticenergy: 2044.46576376 hartree
xcener: -151.861812145338 hartree
chargesum: 0.0000000
charge: -0.055079 -0.059331 -0.286090 -0.445439 -0.328410 -0.088207 0.089366 0.030558 -0.078018 -0.268621 -0.269778 -0.204245 0.396911 0.044163 0.425194 0.013267 -0.233809 -0.190996 -0.189386 0.231461 -0.118609 -0.226034 0.266653 -0.239771 -0.181055 -0.124682 -0.142928 -0.180617 0.079992 0.098841 0.101494 0.098142 0.095602 0.102597 0.098711 0.091874 0.129089 0.137679 0.147628 0.145303 0.159231 0.149355 0.146912 0.156071 0.157486 0.159309 0.158214
qa: -0.0551 -0.0593 -0.2861 -0.4454 -0.3284 -0.0882 0.0894 0.0306 -0.0780 -0.2686 -0.2698 -0.2042 0.3969 0.0442 0.4252 0.0133 -0.2338 -0.1910 -0.1894 0.2315 -0.1186 -0.2260 0.2667 -0.2398 -0.1811 -0.1247 -0.1429 -0.1806 0.0800 0.0988 0.1015 0.0981 0.0956 0.1026 0.0987 0.0919 0.1291 0.1377 0.1476 0.1453 0.1592 0.1494 0.1469 0.1561 0.1575 0.1593 0.1582
va: 1.2703 1.2456 2.1352 2.0689 2.0791 3.1109 3.7291 3.8709 3.8519 3.9066 3.9118 3.9045 4.1883 4.2143 3.7258 3.6048 4.0760 3.9488 3.9564 3.7772 3.9087 4.0080 3.7049 4.0091 3.9084 3.8849 3.8926 3.9018 1.0485 1.0316 0.9986 1.0003 1.0180 1.0001 1.0013 1.0058 1.0194 1.0173 1.0132 1.0075 0.9895 1.0046 1.0071 0.9970 0.9892 0.9901 0.9904
dispcorr: -0.023194453 hartree
energy: -2050.710213441950
dipole: -4.59353 5.02033 0.42680 31.90329 -31.56289 0.34040 21.45034 -19.84907 1.60127
magnitude: 1.69177 au
magnitude: 4.30015 debye
